{"text_format":"1","workbook":"xlsx","n_sheets":4,"sheets":["Selection","Master","Factor","Style navne sprog"],"not_rendered":{"charts":0,"images":1,"macros":1,"external_links":0,"defined_names":41,"comments":0,"pivot_tables":1},"unopened":[],"bounds":{"document_bytes":16777216,"sheet_cells":100000,"rows_first":2000,"rows_last":500,"rows_between":2000,"halvings":0,"cell_chars":16384,"cell_head_chars":4096},"cells_cut":0,"cells_raw":0,"read":"whole","date_system":"1900"}

{"sheet":"Selection","index":0,"n_rows":4,"n_cols":2,"rows_kept":4,"cut":false,"hidden":false,"merged":[]}
[]
[]
["Factor",2]
["Language","GB"]

{"sheet":"Master","index":1,"n_rows":296,"n_cols":6,"rows_kept":296,"cut":false,"hidden":false,"merged":[[3,4,3,5],[4,4,4,5]]}
["Style","Beskrivelse","EUR Forhandler 1 stk   ","EUR Forhandler 50 stk ","Str.","EUR Forhandler overstr. "]
["a","a",0,null,null,0]
["NO.",{"$f":"IF(Selection!$B$4=\"DK\",\"PRODUKTNAVN\",IF(Selection!$B$4=\"DE\",\"PRODUKTNAME\",IF(Selection!$B$4=\"GB\",\"PRODUCT NAME\",IF(Selection!$B$4=\"SE\",\"PRODUKTNAMN\",IF(Selection!$B$4=\"NO\",\"PRODUKTNAVN\",IF(Selection!$B$4=\"PL\",\"NAZWA PRODUKTU\"))))))","v":"PRODUCT NAME"},"PREIS"]
["-",null,"EUR",null,"SIZE ADD-ON EUR"]
[null,null,"1 pcs","100 pcs","1 pcs"]
[]
[{"$f":"IF(Selection!$B$4=\"PL\",\"T-SHIRTY\",IF(Selection!$B$4=\"NO\",\"T-SKJORTER\",\"T-SHIRTS\"))","v":"T-SHIRTS"}]
["0500",{"$f":"IF(Selection!$B$4=\"DK\",VLOOKUP($A8,'Style navne sprog'!$A:$I,6,FALSE),IF(Selection!$B$4=\"DE\",VLOOKUP($A8,'Style navne sprog'!$A:$I,2,FALSE),IF(Selection!$B$4=\"GB\",VLOOKUP($A8,'Style navne sprog'!$A:$I,4,FALSE),IF(Selection!$B$4=\"SE\",VLOOKUP($A8,'Style navne sprog'!$A:$I,3,FALSE),IF(Selection!$B$4=\"NO\",VLOOKUP($A8,'Style navne sprog'!$A:$I,5,FALSE),IF(Selection!$B$4=\"PL\",VLOOKUP($A8,'Style navne sprog'!$A:$I,7,FALSE)))))))","v":"GAME® T-shirt"},8.4500000000000011,7.8000000000000007,"3XL",1.4000000000000001]
["0502",{"$f":"IF(Selection!$B$4=\"DK\",VLOOKUP($A9,'Style navne sprog'!$A:$I,6,FALSE),IF(Selection!$B$4=\"DE\",VLOOKUP($A9,'Style navne sprog'!$A:$I,2,FALSE),IF(Selection!$B$4=\"GB\",VLOOKUP($A9,'Style navne sprog'!$A:$I,4,FALSE),IF(Selection!$B$4=\"SE\",VLOOKUP($A9,'Style navne sprog'!$A:$I,3,FALSE),IF(Selection!$B$4=\"NO\",VLOOKUP($A9,'Style navne sprog'!$A:$I,5,FALSE),IF(Selection!$B$4=\"PL\",VLOOKUP($A9,'Style navne sprog'!$A:$I,7,FALSE)))))))","v":"T-TIME® T-shirt | tight"},10.55,9.8500000000000014,"3XL",1.4000000000000001]
["0506",{"$f":"IF(Selection!$B$4=\"DK\",VLOOKUP($A10,'Style navne sprog'!$A:$I,6,FALSE),IF(Selection!$B$4=\"DE\",VLOOKUP($A10,'Style navne sprog'!$A:$I,2,FALSE),IF(Selection!$B$4=\"GB\",VLOOKUP($A10,'Style navne sprog'!$A:$I,4,FALSE),IF(Selection!$B$4=\"SE\",VLOOKUP($A10,'Style navne sprog'!$A:$I,3,FALSE),IF(Selection!$B$4=\"NO\",VLOOKUP($A10,'Style navne sprog'!$A:$I,5,FALSE),IF(Selection!$B$4=\"PL\",VLOOKUP($A10,'Style navne sprog'!$A:$I,7,FALSE)))))))","v":"Interlock T-shirt | v-neck | women"},14.75,14.100000000000001,"3XL-4XL",1.4000000000000001]
["0508",{"$f":"IF(Selection!$B$4=\"DK\",VLOOKUP($A11,'Style navne sprog'!$A:$I,6,FALSE),IF(Selection!$B$4=\"DE\",VLOOKUP($A11,'Style navne sprog'!$A:$I,2,FALSE),IF(Selection!$B$4=\"GB\",VLOOKUP($A11,'Style navne sprog'!$A:$I,4,FALSE),IF(Selection!$B$4=\"SE\",VLOOKUP($A11,'Style navne sprog'!$A:$I,3,FALSE),IF(Selection!$B$4=\"NO\",VLOOKUP($A11,'Style navne sprog'!$A:$I,5,FALSE),IF(Selection!$B$4=\"PL\",VLOOKUP($A11,'Style navne sprog'!$A:$I,7,FALSE)))))))","v":"Interlock T-shirt | women"},14.75,14.100000000000001,"3XL-4XL",1.4000000000000001]
["0509",{"$f":"IF(Selection!$B$4=\"DK\",VLOOKUP($A12,'Style navne sprog'!$A:$I,6,FALSE),IF(Selection!$B$4=\"DE\",VLOOKUP($A12,'Style navne sprog'!$A:$I,2,FALSE),IF(Selection!$B$4=\"GB\",VLOOKUP($A12,'Style navne sprog'!$A:$I,4,FALSE),IF(Selection!$B$4=\"SE\",VLOOKUP($A12,'Style navne sprog'!$A:$I,3,FALSE),IF(Selection!$B$4=\"NO\",VLOOKUP($A12,'Style navne sprog'!$A:$I,5,FALSE),IF(Selection!$B$4=\"PL\",VLOOKUP($A12,'Style navne sprog'!$A:$I,7,FALSE)))))))","v":"Interlock T-shirt | long-sleeved | women"},18.7,18.05,"3XL-4XL",1.4000000000000001]
["0510",{"$f":"IF(Selection!$B$4=\"DK\",VLOOKUP($A13,'Style navne sprog'!$A:$I,6,FALSE),IF(Selection!$B$4=\"DE\",VLOOKUP($A13,'Style navne sprog'!$A:$I,2,FALSE),IF(Selection!$B$4=\"GB\",VLOOKUP($A13,'Style navne sprog'!$A:$I,4,FALSE),IF(Selection!$B$4=\"SE\",VLOOKUP($A13,'Style navne sprog'!$A:$I,3,FALSE),IF(Selection!$B$4=\"NO\",VLOOKUP($A13,'Style navne sprog'!$A:$I,5,FALSE),IF(Selection!$B$4=\"PL\",VLOOKUP($A13,'Style navne sprog'!$A:$I,7,FALSE)))))))","v":"T-TIME® T-shirt"},10.55,9.8500000000000014,"3XL-6XL",1.4000000000000001]
["0511",{"$f":"IF(Selection!$B$4=\"DK\",VLOOKUP($A14,'Style navne sprog'!$A:$I,6,FALSE),IF(Selection!$B$4=\"DE\",VLOOKUP($A14,'Style navne sprog'!$A:$I,2,FALSE),IF(Selection!$B$4=\"GB\",VLOOKUP($A14,'Style navne sprog'!$A:$I,4,FALSE),IF(Selection!$B$4=\"SE\",VLOOKUP($A14,'Style navne sprog'!$A:$I,3,FALSE),IF(Selection!$B$4=\"NO\",VLOOKUP($A14,'Style navne sprog'!$A:$I,5,FALSE),IF(Selection!$B$4=\"PL\",VLOOKUP($A14,'Style navne sprog'!$A:$I,7,FALSE)))))))","v":"T-TIME® T-shirt | women"},10.55,9.8500000000000014,"3XL-6XL",1.4000000000000001]
["0514",{"$f":"IF(Selection!$B$4=\"DK\",VLOOKUP($A15,'Style navne sprog'!$A:$I,6,FALSE),IF(Selection!$B$4=\"DE\",VLOOKUP($A15,'Style navne sprog'!$A:$I,2,FALSE),IF(Selection!$B$4=\"GB\",VLOOKUP($A15,'Style navne sprog'!$A:$I,4,FALSE),IF(Selection!$B$4=\"SE\",VLOOKUP($A15,'Style navne sprog'!$A:$I,3,FALSE),IF(Selection!$B$4=\"NO\",VLOOKUP($A15,'Style navne sprog'!$A:$I,5,FALSE),IF(Selection!$B$4=\"PL\",VLOOKUP($A15,'Style navne sprog'!$A:$I,7,FALSE)))))))","v":"T-TIME® T-shirt | v-neck"},10.55,9.8500000000000014,"",""]
["0517",{"$f":"IF(Selection!$B$4=\"DK\",VLOOKUP($A16,'Style navne sprog'!$A:$I,6,FALSE),IF(Selection!$B$4=\"DE\",VLOOKUP($A16,'Style navne sprog'!$A:$I,2,FALSE),IF(Selection!$B$4=\"GB\",VLOOKUP($A16,'Style navne sprog'!$A:$I,4,FALSE),IF(Selection!$B$4=\"SE\",VLOOKUP($A16,'Style navne sprog'!$A:$I,3,FALSE),IF(Selection!$B$4=\"NO\",VLOOKUP($A16,'Style navne sprog'!$A:$I,5,FALSE),IF(Selection!$B$4=\"PL\",VLOOKUP($A16,'Style navne sprog'!$A:$I,7,FALSE)))))))","v":"Interlock T-shirt"},14.75,14.100000000000001,"3XL",1.4000000000000001]
["0518",{"$f":"IF(Selection!$B$4=\"DK\",VLOOKUP($A17,'Style navne sprog'!$A:$I,6,FALSE),IF(Selection!$B$4=\"DE\",VLOOKUP($A17,'Style navne sprog'!$A:$I,2,FALSE),IF(Selection!$B$4=\"GB\",VLOOKUP($A17,'Style navne sprog'!$A:$I,4,FALSE),IF(Selection!$B$4=\"SE\",VLOOKUP($A17,'Style navne sprog'!$A:$I,3,FALSE),IF(Selection!$B$4=\"NO\",VLOOKUP($A17,'Style navne sprog'!$A:$I,5,FALSE),IF(Selection!$B$4=\"PL\",VLOOKUP($A17,'Style navne sprog'!$A:$I,7,FALSE)))))))","v":"Interlock T-shirt | long-sleeved"},18.7,18.05,"3XL",1.4000000000000001]
["0524",{"$f":"IF(Selection!$B$4=\"DK\",VLOOKUP($A18,'Style navne sprog'!$A:$I,6,FALSE),IF(Selection!$B$4=\"DE\",VLOOKUP($A18,'Style navne sprog'!$A:$I,2,FALSE),IF(Selection!$B$4=\"GB\",VLOOKUP($A18,'Style navne sprog'!$A:$I,4,FALSE),IF(Selection!$B$4=\"SE\",VLOOKUP($A18,'Style navne sprog'!$A:$I,3,FALSE),IF(Selection!$B$4=\"NO\",VLOOKUP($A18,'Style navne sprog'!$A:$I,5,FALSE),IF(Selection!$B$4=\"PL\",VLOOKUP($A18,'Style navne sprog'!$A:$I,7,FALSE)))))))","v":"RE-CARE T-shirt | unisex"},21.35,20.650000000000002,"3XL-4XL",1.4000000000000001]
["0528",{"$f":"IF(Selection!$B$4=\"DK\",VLOOKUP($A19,'Style navne sprog'!$A:$I,6,FALSE),IF(Selection!$B$4=\"DE\",VLOOKUP($A19,'Style navne sprog'!$A:$I,2,FALSE),IF(Selection!$B$4=\"GB\",VLOOKUP($A19,'Style navne sprog'!$A:$I,4,FALSE),IF(Selection!$B$4=\"SE\",VLOOKUP($A19,'Style navne sprog'!$A:$I,3,FALSE),IF(Selection!$B$4=\"NO\",VLOOKUP($A19,'Style navne sprog'!$A:$I,5,FALSE),IF(Selection!$B$4=\"PL\",VLOOKUP($A19,'Style navne sprog'!$A:$I,7,FALSE)))))))","v":"T-shirt Lyocell"},19.600000000000001,18.95,"3XL-6XL",1.4000000000000001]
["0529",{"$f":"IF(Selection!$B$4=\"DK\",VLOOKUP($A20,'Style navne sprog'!$A:$I,6,FALSE),IF(Selection!$B$4=\"DE\",VLOOKUP($A20,'Style navne sprog'!$A:$I,2,FALSE),IF(Selection!$B$4=\"GB\",VLOOKUP($A20,'Style navne sprog'!$A:$I,4,FALSE),IF(Selection!$B$4=\"SE\",VLOOKUP($A20,'Style navne sprog'!$A:$I,3,FALSE),IF(Selection!$B$4=\"NO\",VLOOKUP($A20,'Style navne sprog'!$A:$I,5,FALSE),IF(Selection!$B$4=\"PL\",VLOOKUP($A20,'Style navne sprog'!$A:$I,7,FALSE)))))))","v":"T-shirt Lyocell | women"},19.600000000000001,18.95,"3XL-6XL",1.4000000000000001]
["0546",{"$f":"IF(Selection!$B$4=\"DK\",VLOOKUP($A21,'Style navne sprog'!$A:$I,6,FALSE),IF(Selection!$B$4=\"DE\",VLOOKUP($A21,'Style navne sprog'!$A:$I,2,FALSE),IF(Selection!$B$4=\"GB\",VLOOKUP($A21,'Style navne sprog'!$A:$I,4,FALSE),IF(Selection!$B$4=\"SE\",VLOOKUP($A21,'Style navne sprog'!$A:$I,3,FALSE),IF(Selection!$B$4=\"NO\",VLOOKUP($A21,'Style navne sprog'!$A:$I,5,FALSE),IF(Selection!$B$4=\"PL\",VLOOKUP($A21,'Style navne sprog'!$A:$I,7,FALSE)))))))","v":"T-TIME® T-shirt | turtleneck"},23.85,23.150000000000002,"",""]
["0550",{"$f":"IF(Selection!$B$4=\"DK\",VLOOKUP($A22,'Style navne sprog'!$A:$I,6,FALSE),IF(Selection!$B$4=\"DE\",VLOOKUP($A22,'Style navne sprog'!$A:$I,2,FALSE),IF(Selection!$B$4=\"GB\",VLOOKUP($A22,'Style navne sprog'!$A:$I,4,FALSE),IF(Selection!$B$4=\"SE\",VLOOKUP($A22,'Style navne sprog'!$A:$I,3,FALSE),IF(Selection!$B$4=\"NO\",VLOOKUP($A22,'Style navne sprog'!$A:$I,5,FALSE),IF(Selection!$B$4=\"PL\",VLOOKUP($A22,'Style navne sprog'!$A:$I,7,FALSE)))))))","v":"T-TIME® T-shirt | chest pocket"},12.600000000000001,11.950000000000001,"3XL",1.4000000000000001]
["0552",{"$f":"IF(Selection!$B$4=\"DK\",VLOOKUP($A23,'Style navne sprog'!$A:$I,6,FALSE),IF(Selection!$B$4=\"DE\",VLOOKUP($A23,'Style navne sprog'!$A:$I,2,FALSE),IF(Selection!$B$4=\"GB\",VLOOKUP($A23,'Style navne sprog'!$A:$I,4,FALSE),IF(Selection!$B$4=\"SE\",VLOOKUP($A23,'Style navne sprog'!$A:$I,3,FALSE),IF(Selection!$B$4=\"NO\",VLOOKUP($A23,'Style navne sprog'!$A:$I,5,FALSE),IF(Selection!$B$4=\"PL\",VLOOKUP($A23,'Style navne sprog'!$A:$I,7,FALSE)))))))","v":"T-shirt | organic"},12,11.350000000000001,"3XL-4XL",1.4000000000000001]
["0553",{"$f":"IF(Selection!$B$4=\"DK\",VLOOKUP($A24,'Style navne sprog'!$A:$I,6,FALSE),IF(Selection!$B$4=\"DE\",VLOOKUP($A24,'Style navne sprog'!$A:$I,2,FALSE),IF(Selection!$B$4=\"GB\",VLOOKUP($A24,'Style navne sprog'!$A:$I,4,FALSE),IF(Selection!$B$4=\"SE\",VLOOKUP($A24,'Style navne sprog'!$A:$I,3,FALSE),IF(Selection!$B$4=\"NO\",VLOOKUP($A24,'Style navne sprog'!$A:$I,5,FALSE),IF(Selection!$B$4=\"PL\",VLOOKUP($A24,'Style navne sprog'!$A:$I,7,FALSE)))))))","v":"T-shirt | organic | women"},12,11.350000000000001,"3XL",1.4000000000000001]
["0594",{"$f":"IF(Selection!$B$4=\"DK\",VLOOKUP($A25,'Style navne sprog'!$A:$I,6,FALSE),IF(Selection!$B$4=\"DE\",VLOOKUP($A25,'Style navne sprog'!$A:$I,2,FALSE),IF(Selection!$B$4=\"GB\",VLOOKUP($A25,'Style navne sprog'!$A:$I,4,FALSE),IF(Selection!$B$4=\"SE\",VLOOKUP($A25,'Style navne sprog'!$A:$I,3,FALSE),IF(Selection!$B$4=\"NO\",VLOOKUP($A25,'Style navne sprog'!$A:$I,5,FALSE),IF(Selection!$B$4=\"PL\",VLOOKUP($A25,'Style navne sprog'!$A:$I,7,FALSE)))))))","v":"Stretch T-shirt | comfort"},14.05,13.350000000000001,"3XL",1.4000000000000001]
["0595",{"$f":"IF(Selection!$B$4=\"DK\",VLOOKUP($A26,'Style navne sprog'!$A:$I,6,FALSE),IF(Selection!$B$4=\"DE\",VLOOKUP($A26,'Style navne sprog'!$A:$I,2,FALSE),IF(Selection!$B$4=\"GB\",VLOOKUP($A26,'Style navne sprog'!$A:$I,4,FALSE),IF(Selection!$B$4=\"SE\",VLOOKUP($A26,'Style navne sprog'!$A:$I,3,FALSE),IF(Selection!$B$4=\"NO\",VLOOKUP($A26,'Style navne sprog'!$A:$I,5,FALSE),IF(Selection!$B$4=\"PL\",VLOOKUP($A26,'Style navne sprog'!$A:$I,7,FALSE)))))))","v":"Stretch T-shirt | comfort | women"},14.05,13.350000000000001,"3XL",1.4000000000000001]
["0597",{"$f":"IF(Selection!$B$4=\"DK\",VLOOKUP($A27,'Style navne sprog'!$A:$I,6,FALSE),IF(Selection!$B$4=\"DE\",VLOOKUP($A27,'Style navne sprog'!$A:$I,2,FALSE),IF(Selection!$B$4=\"GB\",VLOOKUP($A27,'Style navne sprog'!$A:$I,4,FALSE),IF(Selection!$B$4=\"SE\",VLOOKUP($A27,'Style navne sprog'!$A:$I,3,FALSE),IF(Selection!$B$4=\"NO\",VLOOKUP($A27,'Style navne sprog'!$A:$I,5,FALSE),IF(Selection!$B$4=\"PL\",VLOOKUP($A27,'Style navne sprog'!$A:$I,7,FALSE)))))))","v":"Stretch T-shirt | ¾ sleeved | women"},18.650000000000002,18,"3XL",1.4000000000000001]
["0598",{"$f":"IF(Selection!$B$4=\"DK\",VLOOKUP($A28,'Style navne sprog'!$A:$I,6,FALSE),IF(Selection!$B$4=\"DE\",VLOOKUP($A28,'Style navne sprog'!$A:$I,2,FALSE),IF(Selection!$B$4=\"GB\",VLOOKUP($A28,'Style navne sprog'!$A:$I,4,FALSE),IF(Selection!$B$4=\"SE\",VLOOKUP($A28,'Style navne sprog'!$A:$I,3,FALSE),IF(Selection!$B$4=\"NO\",VLOOKUP($A28,'Style navne sprog'!$A:$I,5,FALSE),IF(Selection!$B$4=\"PL\",VLOOKUP($A28,'Style navne sprog'!$A:$I,7,FALSE)))))))","v":"Tank top | stretch"},13.3,12.600000000000001,"3XL",1.4000000000000001]
["0599",{"$f":"IF(Selection!$B$4=\"DK\",VLOOKUP($A29,'Style navne sprog'!$A:$I,6,FALSE),IF(Selection!$B$4=\"DE\",VLOOKUP($A29,'Style navne sprog'!$A:$I,2,FALSE),IF(Selection!$B$4=\"GB\",VLOOKUP($A29,'Style navne sprog'!$A:$I,4,FALSE),IF(Selection!$B$4=\"SE\",VLOOKUP($A29,'Style navne sprog'!$A:$I,3,FALSE),IF(Selection!$B$4=\"NO\",VLOOKUP($A29,'Style navne sprog'!$A:$I,5,FALSE),IF(Selection!$B$4=\"PL\",VLOOKUP($A29,'Style navne sprog'!$A:$I,7,FALSE)))))))","v":"Tank top | stretch | women"},13.3,12.600000000000001,"3XL",1.4000000000000001]
["2000",{"$f":"IF(Selection!$B$4=\"DK\",VLOOKUP($A30,'Style navne sprog'!$A:$I,6,FALSE),IF(Selection!$B$4=\"DE\",VLOOKUP($A30,'Style navne sprog'!$A:$I,2,FALSE),IF(Selection!$B$4=\"GB\",VLOOKUP($A30,'Style navne sprog'!$A:$I,4,FALSE),IF(Selection!$B$4=\"SE\",VLOOKUP($A30,'Style navne sprog'!$A:$I,3,FALSE),IF(Selection!$B$4=\"NO\",VLOOKUP($A30,'Style navne sprog'!$A:$I,5,FALSE),IF(Selection!$B$4=\"PL\",VLOOKUP($A30,'Style navne sprog'!$A:$I,7,FALSE)))))))","v":"YES T-shirt"},7,6.3000000000000007,"3XL",1.4000000000000001]
["2030",{"$f":"IF(Selection!$B$4=\"DK\",VLOOKUP($A31,'Style navne sprog'!$A:$I,6,FALSE),IF(Selection!$B$4=\"DE\",VLOOKUP($A31,'Style navne sprog'!$A:$I,2,FALSE),IF(Selection!$B$4=\"GB\",VLOOKUP($A31,'Style navne sprog'!$A:$I,4,FALSE),IF(Selection!$B$4=\"SE\",VLOOKUP($A31,'Style navne sprog'!$A:$I,3,FALSE),IF(Selection!$B$4=\"NO\",VLOOKUP($A31,'Style navne sprog'!$A:$I,5,FALSE),IF(Selection!$B$4=\"PL\",VLOOKUP($A31,'Style navne sprog'!$A:$I,7,FALSE)))))))","v":"YES Active T-shirt"},10.600000000000001,9.9500000000000011,"3XL",1.4000000000000001]
["2032",{"$f":"IF(Selection!$B$4=\"DK\",VLOOKUP($A32,'Style navne sprog'!$A:$I,6,FALSE),IF(Selection!$B$4=\"DE\",VLOOKUP($A32,'Style navne sprog'!$A:$I,2,FALSE),IF(Selection!$B$4=\"GB\",VLOOKUP($A32,'Style navne sprog'!$A:$I,4,FALSE),IF(Selection!$B$4=\"SE\",VLOOKUP($A32,'Style navne sprog'!$A:$I,3,FALSE),IF(Selection!$B$4=\"NO\",VLOOKUP($A32,'Style navne sprog'!$A:$I,5,FALSE),IF(Selection!$B$4=\"PL\",VLOOKUP($A32,'Style navne sprog'!$A:$I,7,FALSE)))))))","v":"YES Active T-shirt | women"},10.600000000000001,9.9500000000000011,"3XL",1.4000000000000001]
[]
[{"$f":"IF(Selection!$B$4=\"PL\",\"KOSZULKI POLO\",IF(Selection!$B$4=\"SE\",\"PIKÉ TRÖJOR\",IF(Selection!$B$4=\"GB\",\"POLO SHIRTS\",IF(Selection!$B$4=\"NO\",\"POLOSKJORTER\",\"POLOSHIRTS\"))))","v":"POLO SHIRTS"}]
["0520",{"$f":"IF(Selection!$B$4=\"DK\",VLOOKUP($A35,'Style navne sprog'!$A:$I,6,FALSE),IF(Selection!$B$4=\"DE\",VLOOKUP($A35,'Style navne sprog'!$A:$I,2,FALSE),IF(Selection!$B$4=\"GB\",VLOOKUP($A35,'Style navne sprog'!$A:$I,4,FALSE),IF(Selection!$B$4=\"SE\",VLOOKUP($A35,'Style navne sprog'!$A:$I,3,FALSE),IF(Selection!$B$4=\"NO\",VLOOKUP($A35,'Style navne sprog'!$A:$I,5,FALSE),IF(Selection!$B$4=\"PL\",VLOOKUP($A35,'Style navne sprog'!$A:$I,7,FALSE)))))))","v":"Polo shirt classic"},22.400000000000002,21.05,"3XL-6XL",2.7]
["0521",{"$f":"IF(Selection!$B$4=\"DK\",VLOOKUP($A36,'Style navne sprog'!$A:$I,6,FALSE),IF(Selection!$B$4=\"DE\",VLOOKUP($A36,'Style navne sprog'!$A:$I,2,FALSE),IF(Selection!$B$4=\"GB\",VLOOKUP($A36,'Style navne sprog'!$A:$I,4,FALSE),IF(Selection!$B$4=\"SE\",VLOOKUP($A36,'Style navne sprog'!$A:$I,3,FALSE),IF(Selection!$B$4=\"NO\",VLOOKUP($A36,'Style navne sprog'!$A:$I,5,FALSE),IF(Selection!$B$4=\"PL\",VLOOKUP($A36,'Style navne sprog'!$A:$I,7,FALSE)))))))","v":"Polo shirt classic | women"},22.400000000000002,21.05,"3XL",2.7]
["0522",{"$f":"IF(Selection!$B$4=\"DK\",VLOOKUP($A37,'Style navne sprog'!$A:$I,6,FALSE),IF(Selection!$B$4=\"DE\",VLOOKUP($A37,'Style navne sprog'!$A:$I,2,FALSE),IF(Selection!$B$4=\"GB\",VLOOKUP($A37,'Style navne sprog'!$A:$I,4,FALSE),IF(Selection!$B$4=\"SE\",VLOOKUP($A37,'Style navne sprog'!$A:$I,3,FALSE),IF(Selection!$B$4=\"NO\",VLOOKUP($A37,'Style navne sprog'!$A:$I,5,FALSE),IF(Selection!$B$4=\"PL\",VLOOKUP($A37,'Style navne sprog'!$A:$I,7,FALSE)))))))","v":"Contrast polo shirt | stretch"},26.3,24.950000000000003,"3XL-4XL",2.7]
["0523",{"$f":"IF(Selection!$B$4=\"DK\",VLOOKUP($A38,'Style navne sprog'!$A:$I,6,FALSE),IF(Selection!$B$4=\"DE\",VLOOKUP($A38,'Style navne sprog'!$A:$I,2,FALSE),IF(Selection!$B$4=\"GB\",VLOOKUP($A38,'Style navne sprog'!$A:$I,4,FALSE),IF(Selection!$B$4=\"SE\",VLOOKUP($A38,'Style navne sprog'!$A:$I,3,FALSE),IF(Selection!$B$4=\"NO\",VLOOKUP($A38,'Style navne sprog'!$A:$I,5,FALSE),IF(Selection!$B$4=\"PL\",VLOOKUP($A38,'Style navne sprog'!$A:$I,7,FALSE)))))))","v":"Contrast polo shirt | stretch | women"},26.3,24.950000000000003,"3XL-4XL",2.7]
["0525",{"$f":"IF(Selection!$B$4=\"DK\",VLOOKUP($A39,'Style navne sprog'!$A:$I,6,FALSE),IF(Selection!$B$4=\"DE\",VLOOKUP($A39,'Style navne sprog'!$A:$I,2,FALSE),IF(Selection!$B$4=\"GB\",VLOOKUP($A39,'Style navne sprog'!$A:$I,4,FALSE),IF(Selection!$B$4=\"SE\",VLOOKUP($A39,'Style navne sprog'!$A:$I,3,FALSE),IF(Selection!$B$4=\"NO\",VLOOKUP($A39,'Style navne sprog'!$A:$I,5,FALSE),IF(Selection!$B$4=\"PL\",VLOOKUP($A39,'Style navne sprog'!$A:$I,7,FALSE)))))))","v":"Polo shirt | stretch"},24.35,23,"3XL-6XL",2.7]
["0527",{"$f":"IF(Selection!$B$4=\"DK\",VLOOKUP($A40,'Style navne sprog'!$A:$I,6,FALSE),IF(Selection!$B$4=\"DE\",VLOOKUP($A40,'Style navne sprog'!$A:$I,2,FALSE),IF(Selection!$B$4=\"GB\",VLOOKUP($A40,'Style navne sprog'!$A:$I,4,FALSE),IF(Selection!$B$4=\"SE\",VLOOKUP($A40,'Style navne sprog'!$A:$I,3,FALSE),IF(Selection!$B$4=\"NO\",VLOOKUP($A40,'Style navne sprog'!$A:$I,5,FALSE),IF(Selection!$B$4=\"PL\",VLOOKUP($A40,'Style navne sprog'!$A:$I,7,FALSE)))))))","v":"Polo shirt | stretch | women"},24.35,23,"3XL-6XL",2.7]
["0534",{"$f":"IF(Selection!$B$4=\"DK\",VLOOKUP($A41,'Style navne sprog'!$A:$I,6,FALSE),IF(Selection!$B$4=\"DE\",VLOOKUP($A41,'Style navne sprog'!$A:$I,2,FALSE),IF(Selection!$B$4=\"GB\",VLOOKUP($A41,'Style navne sprog'!$A:$I,4,FALSE),IF(Selection!$B$4=\"SE\",VLOOKUP($A41,'Style navne sprog'!$A:$I,3,FALSE),IF(Selection!$B$4=\"NO\",VLOOKUP($A41,'Style navne sprog'!$A:$I,5,FALSE),IF(Selection!$B$4=\"PL\",VLOOKUP($A41,'Style navne sprog'!$A:$I,7,FALSE)))))))","v":"Business polo shirt | jersey"},32.15,"","3XL-4XL",2.7]
["0535",{"$f":"IF(Selection!$B$4=\"DK\",VLOOKUP($A42,'Style navne sprog'!$A:$I,6,FALSE),IF(Selection!$B$4=\"DE\",VLOOKUP($A42,'Style navne sprog'!$A:$I,2,FALSE),IF(Selection!$B$4=\"GB\",VLOOKUP($A42,'Style navne sprog'!$A:$I,4,FALSE),IF(Selection!$B$4=\"SE\",VLOOKUP($A42,'Style navne sprog'!$A:$I,3,FALSE),IF(Selection!$B$4=\"NO\",VLOOKUP($A42,'Style navne sprog'!$A:$I,5,FALSE),IF(Selection!$B$4=\"PL\",VLOOKUP($A42,'Style navne sprog'!$A:$I,7,FALSE)))))))","v":"Business polo shirt | jersey | women"},32.15,"","3XL",2.7]
["0544",{"$f":"IF(Selection!$B$4=\"DK\",VLOOKUP($A43,'Style navne sprog'!$A:$I,6,FALSE),IF(Selection!$B$4=\"DE\",VLOOKUP($A43,'Style navne sprog'!$A:$I,2,FALSE),IF(Selection!$B$4=\"GB\",VLOOKUP($A43,'Style navne sprog'!$A:$I,4,FALSE),IF(Selection!$B$4=\"SE\",VLOOKUP($A43,'Style navne sprog'!$A:$I,3,FALSE),IF(Selection!$B$4=\"NO\",VLOOKUP($A43,'Style navne sprog'!$A:$I,5,FALSE),IF(Selection!$B$4=\"PL\",VLOOKUP($A43,'Style navne sprog'!$A:$I,7,FALSE)))))))","v":"Long-sleeved polo shirt | stretch"},27.650000000000002,26.3,"3XL-6XL",2.7]
["0545",{"$f":"IF(Selection!$B$4=\"DK\",VLOOKUP($A44,'Style navne sprog'!$A:$I,6,FALSE),IF(Selection!$B$4=\"DE\",VLOOKUP($A44,'Style navne sprog'!$A:$I,2,FALSE),IF(Selection!$B$4=\"GB\",VLOOKUP($A44,'Style navne sprog'!$A:$I,4,FALSE),IF(Selection!$B$4=\"SE\",VLOOKUP($A44,'Style navne sprog'!$A:$I,3,FALSE),IF(Selection!$B$4=\"NO\",VLOOKUP($A44,'Style navne sprog'!$A:$I,5,FALSE),IF(Selection!$B$4=\"PL\",VLOOKUP($A44,'Style navne sprog'!$A:$I,7,FALSE)))))))","v":"Long-sleeved polo shirt | stretch | women"},27.650000000000002,26.3,"3XL-6XL",2.7]
["0572",{"$f":"IF(Selection!$B$4=\"DK\",VLOOKUP($A45,'Style navne sprog'!$A:$I,6,FALSE),IF(Selection!$B$4=\"DE\",VLOOKUP($A45,'Style navne sprog'!$A:$I,2,FALSE),IF(Selection!$B$4=\"GB\",VLOOKUP($A45,'Style navne sprog'!$A:$I,4,FALSE),IF(Selection!$B$4=\"SE\",VLOOKUP($A45,'Style navne sprog'!$A:$I,3,FALSE),IF(Selection!$B$4=\"NO\",VLOOKUP($A45,'Style navne sprog'!$A:$I,5,FALSE),IF(Selection!$B$4=\"PL\",VLOOKUP($A45,'Style navne sprog'!$A:$I,7,FALSE)))))))","v":"Polo shirt I active"},33.4,"","3XL-4XL",2.7]
["0573",{"$f":"IF(Selection!$B$4=\"DK\",VLOOKUP($A46,'Style navne sprog'!$A:$I,6,FALSE),IF(Selection!$B$4=\"DE\",VLOOKUP($A46,'Style navne sprog'!$A:$I,2,FALSE),IF(Selection!$B$4=\"GB\",VLOOKUP($A46,'Style navne sprog'!$A:$I,4,FALSE),IF(Selection!$B$4=\"SE\",VLOOKUP($A46,'Style navne sprog'!$A:$I,3,FALSE),IF(Selection!$B$4=\"NO\",VLOOKUP($A46,'Style navne sprog'!$A:$I,5,FALSE),IF(Selection!$B$4=\"PL\",VLOOKUP($A46,'Style navne sprog'!$A:$I,7,FALSE)))))))","v":"Polo shirt | active | women"},33.4,"","3XL-4XL",2.7]
["0586",{"$f":"IF(Selection!$B$4=\"DK\",VLOOKUP($A47,'Style navne sprog'!$A:$I,6,FALSE),IF(Selection!$B$4=\"DE\",VLOOKUP($A47,'Style navne sprog'!$A:$I,2,FALSE),IF(Selection!$B$4=\"GB\",VLOOKUP($A47,'Style navne sprog'!$A:$I,4,FALSE),IF(Selection!$B$4=\"SE\",VLOOKUP($A47,'Style navne sprog'!$A:$I,3,FALSE),IF(Selection!$B$4=\"NO\",VLOOKUP($A47,'Style navne sprog'!$A:$I,5,FALSE),IF(Selection!$B$4=\"PL\",VLOOKUP($A47,'Style navne sprog'!$A:$I,7,FALSE)))))))","v":"Polo shirt | organic"},29.950000000000003,28.6,"3XL-4XL",2.7]
["0587",{"$f":"IF(Selection!$B$4=\"DK\",VLOOKUP($A48,'Style navne sprog'!$A:$I,6,FALSE),IF(Selection!$B$4=\"DE\",VLOOKUP($A48,'Style navne sprog'!$A:$I,2,FALSE),IF(Selection!$B$4=\"GB\",VLOOKUP($A48,'Style navne sprog'!$A:$I,4,FALSE),IF(Selection!$B$4=\"SE\",VLOOKUP($A48,'Style navne sprog'!$A:$I,3,FALSE),IF(Selection!$B$4=\"NO\",VLOOKUP($A48,'Style navne sprog'!$A:$I,5,FALSE),IF(Selection!$B$4=\"PL\",VLOOKUP($A48,'Style navne sprog'!$A:$I,7,FALSE)))))))","v":"Polo shirt | organic | women"},29.950000000000003,28.6,"3XL",2.7]
["2020",{"$f":"IF(Selection!$B$4=\"DK\",VLOOKUP($A49,'Style navne sprog'!$A:$I,6,FALSE),IF(Selection!$B$4=\"DE\",VLOOKUP($A49,'Style navne sprog'!$A:$I,2,FALSE),IF(Selection!$B$4=\"GB\",VLOOKUP($A49,'Style navne sprog'!$A:$I,4,FALSE),IF(Selection!$B$4=\"SE\",VLOOKUP($A49,'Style navne sprog'!$A:$I,3,FALSE),IF(Selection!$B$4=\"NO\",VLOOKUP($A49,'Style navne sprog'!$A:$I,5,FALSE),IF(Selection!$B$4=\"PL\",VLOOKUP($A49,'Style navne sprog'!$A:$I,7,FALSE)))))))","v":"YES polo shirt"},16.150000000000002,"","3XL",2.7]
[]
[{"$f":"IF(Selection!$B$4=\"PL\",\"BLUZY\",\"SWEAT\")","v":"SWEAT"}]
["0600",{"$f":"IF(Selection!$B$4=\"DK\",VLOOKUP($A52,'Style navne sprog'!$A:$I,6,FALSE),IF(Selection!$B$4=\"DE\",VLOOKUP($A52,'Style navne sprog'!$A:$I,2,FALSE),IF(Selection!$B$4=\"GB\",VLOOKUP($A52,'Style navne sprog'!$A:$I,4,FALSE),IF(Selection!$B$4=\"SE\",VLOOKUP($A52,'Style navne sprog'!$A:$I,3,FALSE),IF(Selection!$B$4=\"NO\",VLOOKUP($A52,'Style navne sprog'!$A:$I,5,FALSE),IF(Selection!$B$4=\"PL\",VLOOKUP($A52,'Style navne sprog'!$A:$I,7,FALSE)))))))","v":"Sweatshirt | classic"},28.650000000000002,27.3,"3XL-6XL",2.7]
["0601",{"$f":"IF(Selection!$B$4=\"DK\",VLOOKUP($A53,'Style navne sprog'!$A:$I,6,FALSE),IF(Selection!$B$4=\"DE\",VLOOKUP($A53,'Style navne sprog'!$A:$I,2,FALSE),IF(Selection!$B$4=\"GB\",VLOOKUP($A53,'Style navne sprog'!$A:$I,4,FALSE),IF(Selection!$B$4=\"SE\",VLOOKUP($A53,'Style navne sprog'!$A:$I,3,FALSE),IF(Selection!$B$4=\"NO\",VLOOKUP($A53,'Style navne sprog'!$A:$I,5,FALSE),IF(Selection!$B$4=\"PL\",VLOOKUP($A53,'Style navne sprog'!$A:$I,7,FALSE)))))))","v":"Polo sweatshirt | classic"},33.85,"","3XL-4XL",2.7]
["0603",{"$f":"IF(Selection!$B$4=\"DK\",VLOOKUP($A54,'Style navne sprog'!$A:$I,6,FALSE),IF(Selection!$B$4=\"DE\",VLOOKUP($A54,'Style navne sprog'!$A:$I,2,FALSE),IF(Selection!$B$4=\"GB\",VLOOKUP($A54,'Style navne sprog'!$A:$I,4,FALSE),IF(Selection!$B$4=\"SE\",VLOOKUP($A54,'Style navne sprog'!$A:$I,3,FALSE),IF(Selection!$B$4=\"NO\",VLOOKUP($A54,'Style navne sprog'!$A:$I,5,FALSE),IF(Selection!$B$4=\"PL\",VLOOKUP($A54,'Style navne sprog'!$A:$I,7,FALSE)))))))","v":"Sweatshirt | zip"},44.25,"","3XL",2.7]
["0604",{"$f":"IF(Selection!$B$4=\"DK\",VLOOKUP($A55,'Style navne sprog'!$A:$I,6,FALSE),IF(Selection!$B$4=\"DE\",VLOOKUP($A55,'Style navne sprog'!$A:$I,2,FALSE),IF(Selection!$B$4=\"GB\",VLOOKUP($A55,'Style navne sprog'!$A:$I,4,FALSE),IF(Selection!$B$4=\"SE\",VLOOKUP($A55,'Style navne sprog'!$A:$I,3,FALSE),IF(Selection!$B$4=\"NO\",VLOOKUP($A55,'Style navne sprog'!$A:$I,5,FALSE),IF(Selection!$B$4=\"PL\",VLOOKUP($A55,'Style navne sprog'!$A:$I,7,FALSE)))))))","v":"Classic sweatshirt | cotton"},29.85,"","3XL-4XL",2.7]
["0613",{"$f":"IF(Selection!$B$4=\"DK\",VLOOKUP($A56,'Style navne sprog'!$A:$I,6,FALSE),IF(Selection!$B$4=\"DE\",VLOOKUP($A56,'Style navne sprog'!$A:$I,2,FALSE),IF(Selection!$B$4=\"GB\",VLOOKUP($A56,'Style navne sprog'!$A:$I,4,FALSE),IF(Selection!$B$4=\"SE\",VLOOKUP($A56,'Style navne sprog'!$A:$I,3,FALSE),IF(Selection!$B$4=\"NO\",VLOOKUP($A56,'Style navne sprog'!$A:$I,5,FALSE),IF(Selection!$B$4=\"PL\",VLOOKUP($A56,'Style navne sprog'!$A:$I,7,FALSE)))))))","v":"Sweatshirt | business"},42.800000000000004,"","3XL",2.7]
["0622",{"$f":"IF(Selection!$B$4=\"DK\",VLOOKUP($A57,'Style navne sprog'!$A:$I,6,FALSE),IF(Selection!$B$4=\"DE\",VLOOKUP($A57,'Style navne sprog'!$A:$I,2,FALSE),IF(Selection!$B$4=\"GB\",VLOOKUP($A57,'Style navne sprog'!$A:$I,4,FALSE),IF(Selection!$B$4=\"SE\",VLOOKUP($A57,'Style navne sprog'!$A:$I,3,FALSE),IF(Selection!$B$4=\"NO\",VLOOKUP($A57,'Style navne sprog'!$A:$I,5,FALSE),IF(Selection!$B$4=\"PL\",VLOOKUP($A57,'Style navne sprog'!$A:$I,7,FALSE)))))))","v":"Sweat cardigan"},48.6,"","3XL",2.7]
["0624",{"$f":"IF(Selection!$B$4=\"DK\",VLOOKUP($A58,'Style navne sprog'!$A:$I,6,FALSE),IF(Selection!$B$4=\"DE\",VLOOKUP($A58,'Style navne sprog'!$A:$I,2,FALSE),IF(Selection!$B$4=\"GB\",VLOOKUP($A58,'Style navne sprog'!$A:$I,4,FALSE),IF(Selection!$B$4=\"SE\",VLOOKUP($A58,'Style navne sprog'!$A:$I,3,FALSE),IF(Selection!$B$4=\"NO\",VLOOKUP($A58,'Style navne sprog'!$A:$I,5,FALSE),IF(Selection!$B$4=\"PL\",VLOOKUP($A58,'Style navne sprog'!$A:$I,7,FALSE)))))))","v":"Sweat cardigan | women"},48.6,"","3XL",2.7]
["0626",{"$f":"IF(Selection!$B$4=\"DK\",VLOOKUP($A59,'Style navne sprog'!$A:$I,6,FALSE),IF(Selection!$B$4=\"DE\",VLOOKUP($A59,'Style navne sprog'!$A:$I,2,FALSE),IF(Selection!$B$4=\"GB\",VLOOKUP($A59,'Style navne sprog'!$A:$I,4,FALSE),IF(Selection!$B$4=\"SE\",VLOOKUP($A59,'Style navne sprog'!$A:$I,3,FALSE),IF(Selection!$B$4=\"NO\",VLOOKUP($A59,'Style navne sprog'!$A:$I,5,FALSE),IF(Selection!$B$4=\"PL\",VLOOKUP($A59,'Style navne sprog'!$A:$I,7,FALSE)))))))","v":"Sweat cardigan | contrast"},60.25,"","3XL",2.7]
["0627",{"$f":"IF(Selection!$B$4=\"DK\",VLOOKUP($A60,'Style navne sprog'!$A:$I,6,FALSE),IF(Selection!$B$4=\"DE\",VLOOKUP($A60,'Style navne sprog'!$A:$I,2,FALSE),IF(Selection!$B$4=\"GB\",VLOOKUP($A60,'Style navne sprog'!$A:$I,4,FALSE),IF(Selection!$B$4=\"SE\",VLOOKUP($A60,'Style navne sprog'!$A:$I,3,FALSE),IF(Selection!$B$4=\"NO\",VLOOKUP($A60,'Style navne sprog'!$A:$I,5,FALSE),IF(Selection!$B$4=\"PL\",VLOOKUP($A60,'Style navne sprog'!$A:$I,7,FALSE)))))))","v":"Sweat cardigan | contrast | women"},60.25,"","3XL",2.7]
["0628",{"$f":"IF(Selection!$B$4=\"DK\",VLOOKUP($A61,'Style navne sprog'!$A:$I,6,FALSE),IF(Selection!$B$4=\"DE\",VLOOKUP($A61,'Style navne sprog'!$A:$I,2,FALSE),IF(Selection!$B$4=\"GB\",VLOOKUP($A61,'Style navne sprog'!$A:$I,4,FALSE),IF(Selection!$B$4=\"SE\",VLOOKUP($A61,'Style navne sprog'!$A:$I,3,FALSE),IF(Selection!$B$4=\"NO\",VLOOKUP($A61,'Style navne sprog'!$A:$I,5,FALSE),IF(Selection!$B$4=\"PL\",VLOOKUP($A61,'Style navne sprog'!$A:$I,7,FALSE)))))))","v":"Sweat cardigan | zip"},49.45,"","3XL-4XL",2.7]
["0629",{"$f":"IF(Selection!$B$4=\"DK\",VLOOKUP($A62,'Style navne sprog'!$A:$I,6,FALSE),IF(Selection!$B$4=\"DE\",VLOOKUP($A62,'Style navne sprog'!$A:$I,2,FALSE),IF(Selection!$B$4=\"GB\",VLOOKUP($A62,'Style navne sprog'!$A:$I,4,FALSE),IF(Selection!$B$4=\"SE\",VLOOKUP($A62,'Style navne sprog'!$A:$I,3,FALSE),IF(Selection!$B$4=\"NO\",VLOOKUP($A62,'Style navne sprog'!$A:$I,5,FALSE),IF(Selection!$B$4=\"PL\",VLOOKUP($A62,'Style navne sprog'!$A:$I,7,FALSE)))))))","v":"Sweat cardigan | zip | women"},49.45,"","3XL-4XL",2.7]
["0630",{"$f":"IF(Selection!$B$4=\"DK\",VLOOKUP($A63,'Style navne sprog'!$A:$I,6,FALSE),IF(Selection!$B$4=\"DE\",VLOOKUP($A63,'Style navne sprog'!$A:$I,2,FALSE),IF(Selection!$B$4=\"GB\",VLOOKUP($A63,'Style navne sprog'!$A:$I,4,FALSE),IF(Selection!$B$4=\"SE\",VLOOKUP($A63,'Style navne sprog'!$A:$I,3,FALSE),IF(Selection!$B$4=\"NO\",VLOOKUP($A63,'Style navne sprog'!$A:$I,5,FALSE),IF(Selection!$B$4=\"PL\",VLOOKUP($A63,'Style navne sprog'!$A:$I,7,FALSE)))))))","v":"Sweat cardigan | bonded"},80.550000000000011,"","3XL",2.7]
["0636",{"$f":"IF(Selection!$B$4=\"DK\",VLOOKUP($A64,'Style navne sprog'!$A:$I,6,FALSE),IF(Selection!$B$4=\"DE\",VLOOKUP($A64,'Style navne sprog'!$A:$I,2,FALSE),IF(Selection!$B$4=\"GB\",VLOOKUP($A64,'Style navne sprog'!$A:$I,4,FALSE),IF(Selection!$B$4=\"SE\",VLOOKUP($A64,'Style navne sprog'!$A:$I,3,FALSE),IF(Selection!$B$4=\"NO\",VLOOKUP($A64,'Style navne sprog'!$A:$I,5,FALSE),IF(Selection!$B$4=\"PL\",VLOOKUP($A64,'Style navne sprog'!$A:$I,7,FALSE)))))))","v":"CORE hoodie"},35.450000000000003,"","3XL-6XL",2.7]
["0637",{"$f":"IF(Selection!$B$4=\"DK\",VLOOKUP($A65,'Style navne sprog'!$A:$I,6,FALSE),IF(Selection!$B$4=\"DE\",VLOOKUP($A65,'Style navne sprog'!$A:$I,2,FALSE),IF(Selection!$B$4=\"GB\",VLOOKUP($A65,'Style navne sprog'!$A:$I,4,FALSE),IF(Selection!$B$4=\"SE\",VLOOKUP($A65,'Style navne sprog'!$A:$I,3,FALSE),IF(Selection!$B$4=\"NO\",VLOOKUP($A65,'Style navne sprog'!$A:$I,5,FALSE),IF(Selection!$B$4=\"PL\",VLOOKUP($A65,'Style navne sprog'!$A:$I,7,FALSE)))))))","v":"CORE hoodie | women"},35.450000000000003,"","3XL",2.7]
["0638",{"$f":"IF(Selection!$B$4=\"DK\",VLOOKUP($A66,'Style navne sprog'!$A:$I,6,FALSE),IF(Selection!$B$4=\"DE\",VLOOKUP($A66,'Style navne sprog'!$A:$I,2,FALSE),IF(Selection!$B$4=\"GB\",VLOOKUP($A66,'Style navne sprog'!$A:$I,4,FALSE),IF(Selection!$B$4=\"SE\",VLOOKUP($A66,'Style navne sprog'!$A:$I,3,FALSE),IF(Selection!$B$4=\"NO\",VLOOKUP($A66,'Style navne sprog'!$A:$I,5,FALSE),IF(Selection!$B$4=\"PL\",VLOOKUP($A66,'Style navne sprog'!$A:$I,7,FALSE)))))))","v":"CORE hoodie | zip"},44.25,"","3XL-6XL",2.7]
["0639",{"$f":"IF(Selection!$B$4=\"DK\",VLOOKUP($A67,'Style navne sprog'!$A:$I,6,FALSE),IF(Selection!$B$4=\"DE\",VLOOKUP($A67,'Style navne sprog'!$A:$I,2,FALSE),IF(Selection!$B$4=\"GB\",VLOOKUP($A67,'Style navne sprog'!$A:$I,4,FALSE),IF(Selection!$B$4=\"SE\",VLOOKUP($A67,'Style navne sprog'!$A:$I,3,FALSE),IF(Selection!$B$4=\"NO\",VLOOKUP($A67,'Style navne sprog'!$A:$I,5,FALSE),IF(Selection!$B$4=\"PL\",VLOOKUP($A67,'Style navne sprog'!$A:$I,7,FALSE)))))))","v":"CORE hoodie | zip | women"},44.25,"","3XL",2.7]
["0660",{"$f":"IF(Selection!$B$4=\"DK\",VLOOKUP($A68,'Style navne sprog'!$A:$I,6,FALSE),IF(Selection!$B$4=\"DE\",VLOOKUP($A68,'Style navne sprog'!$A:$I,2,FALSE),IF(Selection!$B$4=\"GB\",VLOOKUP($A68,'Style navne sprog'!$A:$I,4,FALSE),IF(Selection!$B$4=\"SE\",VLOOKUP($A68,'Style navne sprog'!$A:$I,3,FALSE),IF(Selection!$B$4=\"NO\",VLOOKUP($A68,'Style navne sprog'!$A:$I,5,FALSE),IF(Selection!$B$4=\"PL\",VLOOKUP($A68,'Style navne sprog'!$A:$I,7,FALSE)))))))","v":"Soft hoodie | kangaroo pocket | unisex"},26.700000000000003,"","3XL-4XL",2.7]
["0682",{"$f":"IF(Selection!$B$4=\"DK\",VLOOKUP($A69,'Style navne sprog'!$A:$I,6,FALSE),IF(Selection!$B$4=\"DE\",VLOOKUP($A69,'Style navne sprog'!$A:$I,2,FALSE),IF(Selection!$B$4=\"GB\",VLOOKUP($A69,'Style navne sprog'!$A:$I,4,FALSE),IF(Selection!$B$4=\"SE\",VLOOKUP($A69,'Style navne sprog'!$A:$I,3,FALSE),IF(Selection!$B$4=\"NO\",VLOOKUP($A69,'Style navne sprog'!$A:$I,5,FALSE),IF(Selection!$B$4=\"PL\",VLOOKUP($A69,'Style navne sprog'!$A:$I,7,FALSE)))))))","v":"Sweatshirt | organic"},34.050000000000004,"","3XL-4XL",2.7]
["0683",{"$f":"IF(Selection!$B$4=\"DK\",VLOOKUP($A70,'Style navne sprog'!$A:$I,6,FALSE),IF(Selection!$B$4=\"DE\",VLOOKUP($A70,'Style navne sprog'!$A:$I,2,FALSE),IF(Selection!$B$4=\"GB\",VLOOKUP($A70,'Style navne sprog'!$A:$I,4,FALSE),IF(Selection!$B$4=\"SE\",VLOOKUP($A70,'Style navne sprog'!$A:$I,3,FALSE),IF(Selection!$B$4=\"NO\",VLOOKUP($A70,'Style navne sprog'!$A:$I,5,FALSE),IF(Selection!$B$4=\"PL\",VLOOKUP($A70,'Style navne sprog'!$A:$I,7,FALSE)))))))","v":"Sweatshirt | organic | women"},34.050000000000004,"","3XL",2.7]
[]
["PRO WEAR"]
["0300",{"$f":"IF(Selection!$B$4=\"DK\",VLOOKUP($A73,'Style navne sprog'!$A:$I,6,FALSE),IF(Selection!$B$4=\"DE\",VLOOKUP($A73,'Style navne sprog'!$A:$I,2,FALSE),IF(Selection!$B$4=\"GB\",VLOOKUP($A73,'Style navne sprog'!$A:$I,4,FALSE),IF(Selection!$B$4=\"SE\",VLOOKUP($A73,'Style navne sprog'!$A:$I,3,FALSE),IF(Selection!$B$4=\"NO\",VLOOKUP($A73,'Style navne sprog'!$A:$I,5,FALSE),IF(Selection!$B$4=\"PL\",VLOOKUP($A73,'Style navne sprog'!$A:$I,7,FALSE)))))))","v":"PRO Wear T-shirt"},14.3,13.5,"3XL-6XL",1.4000000000000001]
["0302",{"$f":"IF(Selection!$B$4=\"DK\",VLOOKUP($A74,'Style navne sprog'!$A:$I,6,FALSE),IF(Selection!$B$4=\"DE\",VLOOKUP($A74,'Style navne sprog'!$A:$I,2,FALSE),IF(Selection!$B$4=\"GB\",VLOOKUP($A74,'Style navne sprog'!$A:$I,4,FALSE),IF(Selection!$B$4=\"SE\",VLOOKUP($A74,'Style navne sprog'!$A:$I,3,FALSE),IF(Selection!$B$4=\"NO\",VLOOKUP($A74,'Style navne sprog'!$A:$I,5,FALSE),IF(Selection!$B$4=\"PL\",VLOOKUP($A74,'Style navne sprog'!$A:$I,7,FALSE)))))))","v":"PRO Wear T-shirt | contrast"},17.2,16.400000000000002,"3XL-6XL",1.4000000000000001]
["0310",{"$f":"IF(Selection!$B$4=\"DK\",VLOOKUP($A75,'Style navne sprog'!$A:$I,6,FALSE),IF(Selection!$B$4=\"DE\",VLOOKUP($A75,'Style navne sprog'!$A:$I,2,FALSE),IF(Selection!$B$4=\"GB\",VLOOKUP($A75,'Style navne sprog'!$A:$I,4,FALSE),IF(Selection!$B$4=\"SE\",VLOOKUP($A75,'Style navne sprog'!$A:$I,3,FALSE),IF(Selection!$B$4=\"NO\",VLOOKUP($A75,'Style navne sprog'!$A:$I,5,FALSE),IF(Selection!$B$4=\"PL\",VLOOKUP($A75,'Style navne sprog'!$A:$I,7,FALSE)))))))","v":"PRO Wear T-shirt | light"},13.15,12.350000000000001,"3XL-6XL",1.4000000000000001]
["0311",{"$f":"IF(Selection!$B$4=\"DK\",VLOOKUP($A76,'Style navne sprog'!$A:$I,6,FALSE),IF(Selection!$B$4=\"DE\",VLOOKUP($A76,'Style navne sprog'!$A:$I,2,FALSE),IF(Selection!$B$4=\"GB\",VLOOKUP($A76,'Style navne sprog'!$A:$I,4,FALSE),IF(Selection!$B$4=\"SE\",VLOOKUP($A76,'Style navne sprog'!$A:$I,3,FALSE),IF(Selection!$B$4=\"NO\",VLOOKUP($A76,'Style navne sprog'!$A:$I,5,FALSE),IF(Selection!$B$4=\"PL\",VLOOKUP($A76,'Style navne sprog'!$A:$I,7,FALSE)))))))","v":"PRO Wear T-shirt | long-sleeved"},18.5,17.7,"3XL-6XL",1.4000000000000001]
["0312",{"$f":"IF(Selection!$B$4=\"DK\",VLOOKUP($A77,'Style navne sprog'!$A:$I,6,FALSE),IF(Selection!$B$4=\"DE\",VLOOKUP($A77,'Style navne sprog'!$A:$I,2,FALSE),IF(Selection!$B$4=\"GB\",VLOOKUP($A77,'Style navne sprog'!$A:$I,4,FALSE),IF(Selection!$B$4=\"SE\",VLOOKUP($A77,'Style navne sprog'!$A:$I,3,FALSE),IF(Selection!$B$4=\"NO\",VLOOKUP($A77,'Style navne sprog'!$A:$I,5,FALSE),IF(Selection!$B$4=\"PL\",VLOOKUP($A77,'Style navne sprog'!$A:$I,7,FALSE)))))))","v":"PRO Wear T-shirt | women"},14.3,13.5,"3XL-6XL",1.4000000000000001]
["0313",{"$f":"IF(Selection!$B$4=\"DK\",VLOOKUP($A78,'Style navne sprog'!$A:$I,6,FALSE),IF(Selection!$B$4=\"DE\",VLOOKUP($A78,'Style navne sprog'!$A:$I,2,FALSE),IF(Selection!$B$4=\"GB\",VLOOKUP($A78,'Style navne sprog'!$A:$I,4,FALSE),IF(Selection!$B$4=\"SE\",VLOOKUP($A78,'Style navne sprog'!$A:$I,3,FALSE),IF(Selection!$B$4=\"NO\",VLOOKUP($A78,'Style navne sprog'!$A:$I,5,FALSE),IF(Selection!$B$4=\"PL\",VLOOKUP($A78,'Style navne sprog'!$A:$I,7,FALSE)))))))","v":"PRO Wear T-shirt | ¾ sleeve | women"},15.950000000000001,15.15,"3XL-6XL",1.4000000000000001]
["0315",{"$f":"IF(Selection!$B$4=\"DK\",VLOOKUP($A79,'Style navne sprog'!$A:$I,6,FALSE),IF(Selection!$B$4=\"DE\",VLOOKUP($A79,'Style navne sprog'!$A:$I,2,FALSE),IF(Selection!$B$4=\"GB\",VLOOKUP($A79,'Style navne sprog'!$A:$I,4,FALSE),IF(Selection!$B$4=\"SE\",VLOOKUP($A79,'Style navne sprog'!$A:$I,3,FALSE),IF(Selection!$B$4=\"NO\",VLOOKUP($A79,'Style navne sprog'!$A:$I,5,FALSE),IF(Selection!$B$4=\"PL\",VLOOKUP($A79,'Style navne sprog'!$A:$I,7,FALSE)))))))","v":"PRO Wear T-shirt | ½ sleeve | women"},15.3,14.5,"3XL-6XL",1.4000000000000001]
["0317",{"$f":"IF(Selection!$B$4=\"DK\",VLOOKUP($A80,'Style navne sprog'!$A:$I,6,FALSE),IF(Selection!$B$4=\"DE\",VLOOKUP($A80,'Style navne sprog'!$A:$I,2,FALSE),IF(Selection!$B$4=\"GB\",VLOOKUP($A80,'Style navne sprog'!$A:$I,4,FALSE),IF(Selection!$B$4=\"SE\",VLOOKUP($A80,'Style navne sprog'!$A:$I,3,FALSE),IF(Selection!$B$4=\"NO\",VLOOKUP($A80,'Style navne sprog'!$A:$I,5,FALSE),IF(Selection!$B$4=\"PL\",VLOOKUP($A80,'Style navne sprog'!$A:$I,7,FALSE)))))))","v":"PRO Wear T-shirt | light | women"},13.15,12.350000000000001,"3XL-6XL",1.4000000000000001]
["0320",{"$f":"IF(Selection!$B$4=\"DK\",VLOOKUP($A81,'Style navne sprog'!$A:$I,6,FALSE),IF(Selection!$B$4=\"DE\",VLOOKUP($A81,'Style navne sprog'!$A:$I,2,FALSE),IF(Selection!$B$4=\"GB\",VLOOKUP($A81,'Style navne sprog'!$A:$I,4,FALSE),IF(Selection!$B$4=\"SE\",VLOOKUP($A81,'Style navne sprog'!$A:$I,3,FALSE),IF(Selection!$B$4=\"NO\",VLOOKUP($A81,'Style navne sprog'!$A:$I,5,FALSE),IF(Selection!$B$4=\"PL\",VLOOKUP($A81,'Style navne sprog'!$A:$I,7,FALSE)))))))","v":"PRO Wear polo shirt | pocket"},27.8,26.150000000000002,"3XL-6XL",2.7]
["0321",{"$f":"IF(Selection!$B$4=\"DK\",VLOOKUP($A82,'Style navne sprog'!$A:$I,6,FALSE),IF(Selection!$B$4=\"DE\",VLOOKUP($A82,'Style navne sprog'!$A:$I,2,FALSE),IF(Selection!$B$4=\"GB\",VLOOKUP($A82,'Style navne sprog'!$A:$I,4,FALSE),IF(Selection!$B$4=\"SE\",VLOOKUP($A82,'Style navne sprog'!$A:$I,3,FALSE),IF(Selection!$B$4=\"NO\",VLOOKUP($A82,'Style navne sprog'!$A:$I,5,FALSE),IF(Selection!$B$4=\"PL\",VLOOKUP($A82,'Style navne sprog'!$A:$I,7,FALSE)))))))","v":"PRO Wear polo shirt | women"},27.8,26.150000000000002,"3XL-6XL",2.7]
["0322",{"$f":"IF(Selection!$B$4=\"DK\",VLOOKUP($A83,'Style navne sprog'!$A:$I,6,FALSE),IF(Selection!$B$4=\"DE\",VLOOKUP($A83,'Style navne sprog'!$A:$I,2,FALSE),IF(Selection!$B$4=\"GB\",VLOOKUP($A83,'Style navne sprog'!$A:$I,4,FALSE),IF(Selection!$B$4=\"SE\",VLOOKUP($A83,'Style navne sprog'!$A:$I,3,FALSE),IF(Selection!$B$4=\"NO\",VLOOKUP($A83,'Style navne sprog'!$A:$I,5,FALSE),IF(Selection!$B$4=\"PL\",VLOOKUP($A83,'Style navne sprog'!$A:$I,7,FALSE)))))))","v":"PRO Wear polo shirt | contrast"},31.75,30.150000000000002,"3XL-6XL",2.7]
["0324",{"$f":"IF(Selection!$B$4=\"DK\",VLOOKUP($A84,'Style navne sprog'!$A:$I,6,FALSE),IF(Selection!$B$4=\"DE\",VLOOKUP($A84,'Style navne sprog'!$A:$I,2,FALSE),IF(Selection!$B$4=\"GB\",VLOOKUP($A84,'Style navne sprog'!$A:$I,4,FALSE),IF(Selection!$B$4=\"SE\",VLOOKUP($A84,'Style navne sprog'!$A:$I,3,FALSE),IF(Selection!$B$4=\"NO\",VLOOKUP($A84,'Style navne sprog'!$A:$I,5,FALSE),IF(Selection!$B$4=\"PL\",VLOOKUP($A84,'Style navne sprog'!$A:$I,7,FALSE)))))))","v":"PRO Wear polo shirt | no pocket"},27.8,26.150000000000002,"3XL-6XL",2.7]
["0326",{"$f":"IF(Selection!$B$4=\"DK\",VLOOKUP($A85,'Style navne sprog'!$A:$I,6,FALSE),IF(Selection!$B$4=\"DE\",VLOOKUP($A85,'Style navne sprog'!$A:$I,2,FALSE),IF(Selection!$B$4=\"GB\",VLOOKUP($A85,'Style navne sprog'!$A:$I,4,FALSE),IF(Selection!$B$4=\"SE\",VLOOKUP($A85,'Style navne sprog'!$A:$I,3,FALSE),IF(Selection!$B$4=\"NO\",VLOOKUP($A85,'Style navne sprog'!$A:$I,5,FALSE),IF(Selection!$B$4=\"PL\",VLOOKUP($A85,'Style navne sprog'!$A:$I,7,FALSE)))))))","v":"PRO Wear polo shirt | long-sleeve"},31.75,30.150000000000002,"3XL-6XL",2.7]
["0330",{"$f":"IF(Selection!$B$4=\"DK\",VLOOKUP($A86,'Style navne sprog'!$A:$I,6,FALSE),IF(Selection!$B$4=\"DE\",VLOOKUP($A86,'Style navne sprog'!$A:$I,2,FALSE),IF(Selection!$B$4=\"GB\",VLOOKUP($A86,'Style navne sprog'!$A:$I,4,FALSE),IF(Selection!$B$4=\"SE\",VLOOKUP($A86,'Style navne sprog'!$A:$I,3,FALSE),IF(Selection!$B$4=\"NO\",VLOOKUP($A86,'Style navne sprog'!$A:$I,5,FALSE),IF(Selection!$B$4=\"PL\",VLOOKUP($A86,'Style navne sprog'!$A:$I,7,FALSE)))))))","v":"PRO Wear polo shirt | press stud"},27.8,26.150000000000002,"3XL-6XL",2.7]
["0336",{"$f":"IF(Selection!$B$4=\"DK\",VLOOKUP($A87,'Style navne sprog'!$A:$I,6,FALSE),IF(Selection!$B$4=\"DE\",VLOOKUP($A87,'Style navne sprog'!$A:$I,2,FALSE),IF(Selection!$B$4=\"GB\",VLOOKUP($A87,'Style navne sprog'!$A:$I,4,FALSE),IF(Selection!$B$4=\"SE\",VLOOKUP($A87,'Style navne sprog'!$A:$I,3,FALSE),IF(Selection!$B$4=\"NO\",VLOOKUP($A87,'Style navne sprog'!$A:$I,5,FALSE),IF(Selection!$B$4=\"PL\",VLOOKUP($A87,'Style navne sprog'!$A:$I,7,FALSE)))))))","v":"PRO Wear long-sleeve polo shirt | press stud"},31.75,30.150000000000002,"3XL-6XL",2.7]
["0360",{"$f":"IF(Selection!$B$4=\"DK\",VLOOKUP($A88,'Style navne sprog'!$A:$I,6,FALSE),IF(Selection!$B$4=\"DE\",VLOOKUP($A88,'Style navne sprog'!$A:$I,2,FALSE),IF(Selection!$B$4=\"GB\",VLOOKUP($A88,'Style navne sprog'!$A:$I,4,FALSE),IF(Selection!$B$4=\"SE\",VLOOKUP($A88,'Style navne sprog'!$A:$I,3,FALSE),IF(Selection!$B$4=\"NO\",VLOOKUP($A88,'Style navne sprog'!$A:$I,5,FALSE),IF(Selection!$B$4=\"PL\",VLOOKUP($A88,'Style navne sprog'!$A:$I,7,FALSE)))))))","v":"PRO Wear sweatshirt | classic"},35.75,34.15,"3XL-6XL",2.7]
["0362",{"$f":"IF(Selection!$B$4=\"DK\",VLOOKUP($A89,'Style navne sprog'!$A:$I,6,FALSE),IF(Selection!$B$4=\"DE\",VLOOKUP($A89,'Style navne sprog'!$A:$I,2,FALSE),IF(Selection!$B$4=\"GB\",VLOOKUP($A89,'Style navne sprog'!$A:$I,4,FALSE),IF(Selection!$B$4=\"SE\",VLOOKUP($A89,'Style navne sprog'!$A:$I,3,FALSE),IF(Selection!$B$4=\"NO\",VLOOKUP($A89,'Style navne sprog'!$A:$I,5,FALSE),IF(Selection!$B$4=\"PL\",VLOOKUP($A89,'Style navne sprog'!$A:$I,7,FALSE)))))))","v":"PRO Wear sweatshirt | contrast"},39.800000000000004,38.200000000000003,"3XL-6XL",2.7]
["0366",{"$f":"IF(Selection!$B$4=\"DK\",VLOOKUP($A90,'Style navne sprog'!$A:$I,6,FALSE),IF(Selection!$B$4=\"DE\",VLOOKUP($A90,'Style navne sprog'!$A:$I,2,FALSE),IF(Selection!$B$4=\"GB\",VLOOKUP($A90,'Style navne sprog'!$A:$I,4,FALSE),IF(Selection!$B$4=\"SE\",VLOOKUP($A90,'Style navne sprog'!$A:$I,3,FALSE),IF(Selection!$B$4=\"NO\",VLOOKUP($A90,'Style navne sprog'!$A:$I,5,FALSE),IF(Selection!$B$4=\"PL\",VLOOKUP($A90,'Style navne sprog'!$A:$I,7,FALSE)))))))","v":"PRO Wear cardigan | sweat"},56.7,"","3XL-6XL",2.7]
["0367",{"$f":"IF(Selection!$B$4=\"DK\",VLOOKUP($A91,'Style navne sprog'!$A:$I,6,FALSE),IF(Selection!$B$4=\"DE\",VLOOKUP($A91,'Style navne sprog'!$A:$I,2,FALSE),IF(Selection!$B$4=\"GB\",VLOOKUP($A91,'Style navne sprog'!$A:$I,4,FALSE),IF(Selection!$B$4=\"SE\",VLOOKUP($A91,'Style navne sprog'!$A:$I,3,FALSE),IF(Selection!$B$4=\"NO\",VLOOKUP($A91,'Style navne sprog'!$A:$I,5,FALSE),IF(Selection!$B$4=\"PL\",VLOOKUP($A91,'Style navne sprog'!$A:$I,7,FALSE)))))))","v":"PRO Wear cardigan | sweat | women"},56.7,"","3XL-6XL",2.7]
["0370",{"$f":"IF(Selection!$B$4=\"DK\",VLOOKUP($A92,'Style navne sprog'!$A:$I,6,FALSE),IF(Selection!$B$4=\"DE\",VLOOKUP($A92,'Style navne sprog'!$A:$I,2,FALSE),IF(Selection!$B$4=\"GB\",VLOOKUP($A92,'Style navne sprog'!$A:$I,4,FALSE),IF(Selection!$B$4=\"SE\",VLOOKUP($A92,'Style navne sprog'!$A:$I,3,FALSE),IF(Selection!$B$4=\"NO\",VLOOKUP($A92,'Style navne sprog'!$A:$I,5,FALSE),IF(Selection!$B$4=\"PL\",VLOOKUP($A92,'Style navne sprog'!$A:$I,7,FALSE)))))))","v":"PRO Wear CARE T-shirt"},15.850000000000001,15.05,"3XL-6XL",1.4000000000000001]
["0371",{"$f":"IF(Selection!$B$4=\"DK\",VLOOKUP($A93,'Style navne sprog'!$A:$I,6,FALSE),IF(Selection!$B$4=\"DE\",VLOOKUP($A93,'Style navne sprog'!$A:$I,2,FALSE),IF(Selection!$B$4=\"GB\",VLOOKUP($A93,'Style navne sprog'!$A:$I,4,FALSE),IF(Selection!$B$4=\"SE\",VLOOKUP($A93,'Style navne sprog'!$A:$I,3,FALSE),IF(Selection!$B$4=\"NO\",VLOOKUP($A93,'Style navne sprog'!$A:$I,5,FALSE),IF(Selection!$B$4=\"PL\",VLOOKUP($A93,'Style navne sprog'!$A:$I,7,FALSE)))))))","v":"PRO Wear CARE T-shirt | women"},15.850000000000001,15.05,"3XL-6XL",1.4000000000000001]
["0372",{"$f":"IF(Selection!$B$4=\"DK\",VLOOKUP($A94,'Style navne sprog'!$A:$I,6,FALSE),IF(Selection!$B$4=\"DE\",VLOOKUP($A94,'Style navne sprog'!$A:$I,2,FALSE),IF(Selection!$B$4=\"GB\",VLOOKUP($A94,'Style navne sprog'!$A:$I,4,FALSE),IF(Selection!$B$4=\"SE\",VLOOKUP($A94,'Style navne sprog'!$A:$I,3,FALSE),IF(Selection!$B$4=\"NO\",VLOOKUP($A94,'Style navne sprog'!$A:$I,5,FALSE),IF(Selection!$B$4=\"PL\",VLOOKUP($A94,'Style navne sprog'!$A:$I,7,FALSE)))))))","v":"PRO Wear CARE T-shirt | v-neck"},15.850000000000001,15.05,"3XL-6XL",1.4000000000000001]
["0373",{"$f":"IF(Selection!$B$4=\"DK\",VLOOKUP($A95,'Style navne sprog'!$A:$I,6,FALSE),IF(Selection!$B$4=\"DE\",VLOOKUP($A95,'Style navne sprog'!$A:$I,2,FALSE),IF(Selection!$B$4=\"GB\",VLOOKUP($A95,'Style navne sprog'!$A:$I,4,FALSE),IF(Selection!$B$4=\"SE\",VLOOKUP($A95,'Style navne sprog'!$A:$I,3,FALSE),IF(Selection!$B$4=\"NO\",VLOOKUP($A95,'Style navne sprog'!$A:$I,5,FALSE),IF(Selection!$B$4=\"PL\",VLOOKUP($A95,'Style navne sprog'!$A:$I,7,FALSE)))))))","v":"PRO Wear CARE T-shirt | v-neck | women"},15.850000000000001,15.05,"3XL-6XL",1.4000000000000001]
["0374",{"$f":"IF(Selection!$B$4=\"DK\",VLOOKUP($A96,'Style navne sprog'!$A:$I,6,FALSE),IF(Selection!$B$4=\"DE\",VLOOKUP($A96,'Style navne sprog'!$A:$I,2,FALSE),IF(Selection!$B$4=\"GB\",VLOOKUP($A96,'Style navne sprog'!$A:$I,4,FALSE),IF(Selection!$B$4=\"SE\",VLOOKUP($A96,'Style navne sprog'!$A:$I,3,FALSE),IF(Selection!$B$4=\"NO\",VLOOKUP($A96,'Style navne sprog'!$A:$I,5,FALSE),IF(Selection!$B$4=\"PL\",VLOOKUP($A96,'Style navne sprog'!$A:$I,7,FALSE)))))))","v":"PRO Wear CARE polo shirt"},30.6,29,"3XL-6XL",2.7]
["0375",{"$f":"IF(Selection!$B$4=\"DK\",VLOOKUP($A97,'Style navne sprog'!$A:$I,6,FALSE),IF(Selection!$B$4=\"DE\",VLOOKUP($A97,'Style navne sprog'!$A:$I,2,FALSE),IF(Selection!$B$4=\"GB\",VLOOKUP($A97,'Style navne sprog'!$A:$I,4,FALSE),IF(Selection!$B$4=\"SE\",VLOOKUP($A97,'Style navne sprog'!$A:$I,3,FALSE),IF(Selection!$B$4=\"NO\",VLOOKUP($A97,'Style navne sprog'!$A:$I,5,FALSE),IF(Selection!$B$4=\"PL\",VLOOKUP($A97,'Style navne sprog'!$A:$I,7,FALSE)))))))","v":"PRO Wear CARE polo shirt | women"},30.6,29,"3XL-6XL",2.7]
["0376",{"$f":"IF(Selection!$B$4=\"DK\",VLOOKUP($A98,'Style navne sprog'!$A:$I,6,FALSE),IF(Selection!$B$4=\"DE\",VLOOKUP($A98,'Style navne sprog'!$A:$I,2,FALSE),IF(Selection!$B$4=\"GB\",VLOOKUP($A98,'Style navne sprog'!$A:$I,4,FALSE),IF(Selection!$B$4=\"SE\",VLOOKUP($A98,'Style navne sprog'!$A:$I,3,FALSE),IF(Selection!$B$4=\"NO\",VLOOKUP($A98,'Style navne sprog'!$A:$I,5,FALSE),IF(Selection!$B$4=\"PL\",VLOOKUP($A98,'Style navne sprog'!$A:$I,7,FALSE)))))))","v":"PRO Wear CARE polo shirt | classic"},29,27.400000000000002,"3XL-6XL",2.7]
["0377",{"$f":"IF(Selection!$B$4=\"DK\",VLOOKUP($A99,'Style navne sprog'!$A:$I,6,FALSE),IF(Selection!$B$4=\"DE\",VLOOKUP($A99,'Style navne sprog'!$A:$I,2,FALSE),IF(Selection!$B$4=\"GB\",VLOOKUP($A99,'Style navne sprog'!$A:$I,4,FALSE),IF(Selection!$B$4=\"SE\",VLOOKUP($A99,'Style navne sprog'!$A:$I,3,FALSE),IF(Selection!$B$4=\"NO\",VLOOKUP($A99,'Style navne sprog'!$A:$I,5,FALSE),IF(Selection!$B$4=\"PL\",VLOOKUP($A99,'Style navne sprog'!$A:$I,7,FALSE)))))))","v":"PRO Wear CARE polo shirt | classic | women"},29,27.400000000000002,"3XL-6XL",2.7]
["0380",{"$f":"IF(Selection!$B$4=\"DK\",VLOOKUP($A100,'Style navne sprog'!$A:$I,6,FALSE),IF(Selection!$B$4=\"DE\",VLOOKUP($A100,'Style navne sprog'!$A:$I,2,FALSE),IF(Selection!$B$4=\"GB\",VLOOKUP($A100,'Style navne sprog'!$A:$I,4,FALSE),IF(Selection!$B$4=\"SE\",VLOOKUP($A100,'Style navne sprog'!$A:$I,3,FALSE),IF(Selection!$B$4=\"NO\",VLOOKUP($A100,'Style navne sprog'!$A:$I,5,FALSE),IF(Selection!$B$4=\"PL\",VLOOKUP($A100,'Style navne sprog'!$A:$I,7,FALSE)))))))","v":"PRO Wear CARE sweatshirt | unbrushed"},36.1,34.5,"3XL-6XL",2.7]
["0381",{"$f":"IF(Selection!$B$4=\"DK\",VLOOKUP($A101,'Style navne sprog'!$A:$I,6,FALSE),IF(Selection!$B$4=\"DE\",VLOOKUP($A101,'Style navne sprog'!$A:$I,2,FALSE),IF(Selection!$B$4=\"GB\",VLOOKUP($A101,'Style navne sprog'!$A:$I,4,FALSE),IF(Selection!$B$4=\"SE\",VLOOKUP($A101,'Style navne sprog'!$A:$I,3,FALSE),IF(Selection!$B$4=\"NO\",VLOOKUP($A101,'Style navne sprog'!$A:$I,5,FALSE),IF(Selection!$B$4=\"PL\",VLOOKUP($A101,'Style navne sprog'!$A:$I,7,FALSE)))))))","v":"PRO Wear CARE sweatshirt | unbrushed | women"},36.1,34.5,"3XL-6XL",2.7]
["0382",{"$f":"IF(Selection!$B$4=\"DK\",VLOOKUP($A102,'Style navne sprog'!$A:$I,6,FALSE),IF(Selection!$B$4=\"DE\",VLOOKUP($A102,'Style navne sprog'!$A:$I,2,FALSE),IF(Selection!$B$4=\"GB\",VLOOKUP($A102,'Style navne sprog'!$A:$I,4,FALSE),IF(Selection!$B$4=\"SE\",VLOOKUP($A102,'Style navne sprog'!$A:$I,3,FALSE),IF(Selection!$B$4=\"NO\",VLOOKUP($A102,'Style navne sprog'!$A:$I,5,FALSE),IF(Selection!$B$4=\"PL\",VLOOKUP($A102,'Style navne sprog'!$A:$I,7,FALSE)))))))","v":"PRO Wear CARE cardigan | unbrushed"},57.650000000000006,"","3XL-6XL",2.7]
["0383",{"$f":"IF(Selection!$B$4=\"DK\",VLOOKUP($A103,'Style navne sprog'!$A:$I,6,FALSE),IF(Selection!$B$4=\"DE\",VLOOKUP($A103,'Style navne sprog'!$A:$I,2,FALSE),IF(Selection!$B$4=\"GB\",VLOOKUP($A103,'Style navne sprog'!$A:$I,4,FALSE),IF(Selection!$B$4=\"SE\",VLOOKUP($A103,'Style navne sprog'!$A:$I,3,FALSE),IF(Selection!$B$4=\"NO\",VLOOKUP($A103,'Style navne sprog'!$A:$I,5,FALSE),IF(Selection!$B$4=\"PL\",VLOOKUP($A103,'Style navne sprog'!$A:$I,7,FALSE)))))))","v":"PRO Wear CARE cardigan | unbrushed | women"},57.650000000000006,"","3XL-6XL",2.7]
["0384",{"$f":"IF(Selection!$B$4=\"DK\",VLOOKUP($A104,'Style navne sprog'!$A:$I,6,FALSE),IF(Selection!$B$4=\"DE\",VLOOKUP($A104,'Style navne sprog'!$A:$I,2,FALSE),IF(Selection!$B$4=\"GB\",VLOOKUP($A104,'Style navne sprog'!$A:$I,4,FALSE),IF(Selection!$B$4=\"SE\",VLOOKUP($A104,'Style navne sprog'!$A:$I,3,FALSE),IF(Selection!$B$4=\"NO\",VLOOKUP($A104,'Style navne sprog'!$A:$I,5,FALSE),IF(Selection!$B$4=\"PL\",VLOOKUP($A104,'Style navne sprog'!$A:$I,7,FALSE)))))))","v":"PRO Wear CARE sweat | unbrushed | ¼ zip"},52.300000000000004,"","3XL-6XL",2.7]
["0385",{"$f":"IF(Selection!$B$4=\"DK\",VLOOKUP($A105,'Style navne sprog'!$A:$I,6,FALSE),IF(Selection!$B$4=\"DE\",VLOOKUP($A105,'Style navne sprog'!$A:$I,2,FALSE),IF(Selection!$B$4=\"GB\",VLOOKUP($A105,'Style navne sprog'!$A:$I,4,FALSE),IF(Selection!$B$4=\"SE\",VLOOKUP($A105,'Style navne sprog'!$A:$I,3,FALSE),IF(Selection!$B$4=\"NO\",VLOOKUP($A105,'Style navne sprog'!$A:$I,5,FALSE),IF(Selection!$B$4=\"PL\",VLOOKUP($A105,'Style navne sprog'!$A:$I,7,FALSE)))))))","v":"PRO Wear CARE sweat  | unbrushed | ¼ zip | women"},52.300000000000004,"","3XL-6XL",2.7]
[]
[{"$f":"IF(Selection!$B$4=\"PL\",\"KOSZULE\",IF(Selection!$B$4=\"SE\",\"SKJORTOR\",IF(Selection!$B$4=\"GB\",\"SHIRTS\",IF(Selection!$B$4=\"DE\",\"HEMDEN & BLUSEN\",\"SKJORTER\"))))","v":"SHIRTS"}]
["0204",{"$f":"IF(Selection!$B$4=\"DK\",VLOOKUP($A108,'Style navne sprog'!$A:$I,6,FALSE),IF(Selection!$B$4=\"DE\",VLOOKUP($A108,'Style navne sprog'!$A:$I,2,FALSE),IF(Selection!$B$4=\"GB\",VLOOKUP($A108,'Style navne sprog'!$A:$I,4,FALSE),IF(Selection!$B$4=\"SE\",VLOOKUP($A108,'Style navne sprog'!$A:$I,3,FALSE),IF(Selection!$B$4=\"NO\",VLOOKUP($A108,'Style navne sprog'!$A:$I,5,FALSE),IF(Selection!$B$4=\"PL\",VLOOKUP($A108,'Style navne sprog'!$A:$I,7,FALSE)))))))","v":"Green leaf shirt | press stud"},38,"","47/48-49/50",2.7]
[]
[{"$f":"IF(Selection!$B$4=\"PL\",\"ODZIEZ Z POLARU\",\"FLEECE\")","v":"FLEECE"}]
["0744",{"$f":"IF(Selection!$B$4=\"DK\",VLOOKUP($A111,'Style navne sprog'!$A:$I,6,FALSE),IF(Selection!$B$4=\"DE\",VLOOKUP($A111,'Style navne sprog'!$A:$I,2,FALSE),IF(Selection!$B$4=\"GB\",VLOOKUP($A111,'Style navne sprog'!$A:$I,4,FALSE),IF(Selection!$B$4=\"SE\",VLOOKUP($A111,'Style navne sprog'!$A:$I,3,FALSE),IF(Selection!$B$4=\"NO\",VLOOKUP($A111,'Style navne sprog'!$A:$I,5,FALSE),IF(Selection!$B$4=\"PL\",VLOOKUP($A111,'Style navne sprog'!$A:$I,7,FALSE)))))))","v":"Bonded fleece jacket"},64.3,"","3XL-4XL",4]
["0745",{"$f":"IF(Selection!$B$4=\"DK\",VLOOKUP($A112,'Style navne sprog'!$A:$I,6,FALSE),IF(Selection!$B$4=\"DE\",VLOOKUP($A112,'Style navne sprog'!$A:$I,2,FALSE),IF(Selection!$B$4=\"GB\",VLOOKUP($A112,'Style navne sprog'!$A:$I,4,FALSE),IF(Selection!$B$4=\"SE\",VLOOKUP($A112,'Style navne sprog'!$A:$I,3,FALSE),IF(Selection!$B$4=\"NO\",VLOOKUP($A112,'Style navne sprog'!$A:$I,5,FALSE),IF(Selection!$B$4=\"PL\",VLOOKUP($A112,'Style navne sprog'!$A:$I,7,FALSE)))))))","v":"Bonded fleece jacket | women"},64.3,"","3XL-4XL",4]
["0746",{"$f":"IF(Selection!$B$4=\"DK\",VLOOKUP($A113,'Style navne sprog'!$A:$I,6,FALSE),IF(Selection!$B$4=\"DE\",VLOOKUP($A113,'Style navne sprog'!$A:$I,2,FALSE),IF(Selection!$B$4=\"GB\",VLOOKUP($A113,'Style navne sprog'!$A:$I,4,FALSE),IF(Selection!$B$4=\"SE\",VLOOKUP($A113,'Style navne sprog'!$A:$I,3,FALSE),IF(Selection!$B$4=\"NO\",VLOOKUP($A113,'Style navne sprog'!$A:$I,5,FALSE),IF(Selection!$B$4=\"PL\",VLOOKUP($A113,'Style navne sprog'!$A:$I,7,FALSE)))))))","v":"Bonded fleece vest"},53.550000000000004,"","3XL-4XL",4]
["0747",{"$f":"IF(Selection!$B$4=\"DK\",VLOOKUP($A114,'Style navne sprog'!$A:$I,6,FALSE),IF(Selection!$B$4=\"DE\",VLOOKUP($A114,'Style navne sprog'!$A:$I,2,FALSE),IF(Selection!$B$4=\"GB\",VLOOKUP($A114,'Style navne sprog'!$A:$I,4,FALSE),IF(Selection!$B$4=\"SE\",VLOOKUP($A114,'Style navne sprog'!$A:$I,3,FALSE),IF(Selection!$B$4=\"NO\",VLOOKUP($A114,'Style navne sprog'!$A:$I,5,FALSE),IF(Selection!$B$4=\"PL\",VLOOKUP($A114,'Style navne sprog'!$A:$I,7,FALSE)))))))","v":"Bonded fleece vest | women"},53.550000000000004,"","3XL-4XL",4]
["0792",{"$f":"IF(Selection!$B$4=\"DK\",VLOOKUP($A115,'Style navne sprog'!$A:$I,6,FALSE),IF(Selection!$B$4=\"DE\",VLOOKUP($A115,'Style navne sprog'!$A:$I,2,FALSE),IF(Selection!$B$4=\"GB\",VLOOKUP($A115,'Style navne sprog'!$A:$I,4,FALSE),IF(Selection!$B$4=\"SE\",VLOOKUP($A115,'Style navne sprog'!$A:$I,3,FALSE),IF(Selection!$B$4=\"NO\",VLOOKUP($A115,'Style navne sprog'!$A:$I,5,FALSE),IF(Selection!$B$4=\"PL\",VLOOKUP($A115,'Style navne sprog'!$A:$I,7,FALSE)))))))","v":"Zip-n-Mix microfleece | reflective"},61.6,"","3XL-6XL",4]
["0793",{"$f":"IF(Selection!$B$4=\"DK\",VLOOKUP($A116,'Style navne sprog'!$A:$I,6,FALSE),IF(Selection!$B$4=\"DE\",VLOOKUP($A116,'Style navne sprog'!$A:$I,2,FALSE),IF(Selection!$B$4=\"GB\",VLOOKUP($A116,'Style navne sprog'!$A:$I,4,FALSE),IF(Selection!$B$4=\"SE\",VLOOKUP($A116,'Style navne sprog'!$A:$I,3,FALSE),IF(Selection!$B$4=\"NO\",VLOOKUP($A116,'Style navne sprog'!$A:$I,5,FALSE),IF(Selection!$B$4=\"PL\",VLOOKUP($A116,'Style navne sprog'!$A:$I,7,FALSE)))))))","v":"Zip-n-Mix  microfleece | reflective | women"},61.6,"","3XL-6XL",4]
["0803",{"$f":"IF(Selection!$B$4=\"DK\",VLOOKUP($A117,'Style navne sprog'!$A:$I,6,FALSE),IF(Selection!$B$4=\"DE\",VLOOKUP($A117,'Style navne sprog'!$A:$I,2,FALSE),IF(Selection!$B$4=\"GB\",VLOOKUP($A117,'Style navne sprog'!$A:$I,4,FALSE),IF(Selection!$B$4=\"SE\",VLOOKUP($A117,'Style navne sprog'!$A:$I,3,FALSE),IF(Selection!$B$4=\"NO\",VLOOKUP($A117,'Style navne sprog'!$A:$I,5,FALSE),IF(Selection!$B$4=\"PL\",VLOOKUP($A117,'Style navne sprog'!$A:$I,7,FALSE)))))))","v":"Cardigan | microfleece"},38.85,"","3XL-5XL",4]
["0805",{"$f":"IF(Selection!$B$4=\"DK\",VLOOKUP($A118,'Style navne sprog'!$A:$I,6,FALSE),IF(Selection!$B$4=\"DE\",VLOOKUP($A118,'Style navne sprog'!$A:$I,2,FALSE),IF(Selection!$B$4=\"GB\",VLOOKUP($A118,'Style navne sprog'!$A:$I,4,FALSE),IF(Selection!$B$4=\"SE\",VLOOKUP($A118,'Style navne sprog'!$A:$I,3,FALSE),IF(Selection!$B$4=\"NO\",VLOOKUP($A118,'Style navne sprog'!$A:$I,5,FALSE),IF(Selection!$B$4=\"PL\",VLOOKUP($A118,'Style navne sprog'!$A:$I,7,FALSE)))))))","v":"Cardigan | microfleece | women"},38.85,"","3XL",4]
["0806",{"$f":"IF(Selection!$B$4=\"DK\",VLOOKUP($A119,'Style navne sprog'!$A:$I,6,FALSE),IF(Selection!$B$4=\"DE\",VLOOKUP($A119,'Style navne sprog'!$A:$I,2,FALSE),IF(Selection!$B$4=\"GB\",VLOOKUP($A119,'Style navne sprog'!$A:$I,4,FALSE),IF(Selection!$B$4=\"SE\",VLOOKUP($A119,'Style navne sprog'!$A:$I,3,FALSE),IF(Selection!$B$4=\"NO\",VLOOKUP($A119,'Style navne sprog'!$A:$I,5,FALSE),IF(Selection!$B$4=\"PL\",VLOOKUP($A119,'Style navne sprog'!$A:$I,7,FALSE)))))))","v":"Zip-n-Mix microfleece"},38.85,"","3XL-4XL",4]
["0807",{"$f":"IF(Selection!$B$4=\"DK\",VLOOKUP($A120,'Style navne sprog'!$A:$I,6,FALSE),IF(Selection!$B$4=\"DE\",VLOOKUP($A120,'Style navne sprog'!$A:$I,2,FALSE),IF(Selection!$B$4=\"GB\",VLOOKUP($A120,'Style navne sprog'!$A:$I,4,FALSE),IF(Selection!$B$4=\"SE\",VLOOKUP($A120,'Style navne sprog'!$A:$I,3,FALSE),IF(Selection!$B$4=\"NO\",VLOOKUP($A120,'Style navne sprog'!$A:$I,5,FALSE),IF(Selection!$B$4=\"PL\",VLOOKUP($A120,'Style navne sprog'!$A:$I,7,FALSE)))))))","v":"Zip-n-Mix microfleece | women"},38.85,"","3XL",4]
["0808",{"$f":"IF(Selection!$B$4=\"DK\",VLOOKUP($A121,'Style navne sprog'!$A:$I,6,FALSE),IF(Selection!$B$4=\"DE\",VLOOKUP($A121,'Style navne sprog'!$A:$I,2,FALSE),IF(Selection!$B$4=\"GB\",VLOOKUP($A121,'Style navne sprog'!$A:$I,4,FALSE),IF(Selection!$B$4=\"SE\",VLOOKUP($A121,'Style navne sprog'!$A:$I,3,FALSE),IF(Selection!$B$4=\"NO\",VLOOKUP($A121,'Style navne sprog'!$A:$I,5,FALSE),IF(Selection!$B$4=\"PL\",VLOOKUP($A121,'Style navne sprog'!$A:$I,7,FALSE)))))))","v":"Fleece tunic | unisex"},33.5,"","3XL-6XL",4]
["0809",{"$f":"IF(Selection!$B$4=\"DK\",VLOOKUP($A122,'Style navne sprog'!$A:$I,6,FALSE),IF(Selection!$B$4=\"DE\",VLOOKUP($A122,'Style navne sprog'!$A:$I,2,FALSE),IF(Selection!$B$4=\"GB\",VLOOKUP($A122,'Style navne sprog'!$A:$I,4,FALSE),IF(Selection!$B$4=\"SE\",VLOOKUP($A122,'Style navne sprog'!$A:$I,3,FALSE),IF(Selection!$B$4=\"NO\",VLOOKUP($A122,'Style navne sprog'!$A:$I,5,FALSE),IF(Selection!$B$4=\"PL\",VLOOKUP($A122,'Style navne sprog'!$A:$I,7,FALSE)))))))","v":"Fleece bolero | unisex"},31.05,"",""]
["0811",{"$f":"IF(Selection!$B$4=\"DK\",VLOOKUP($A123,'Style navne sprog'!$A:$I,6,FALSE),IF(Selection!$B$4=\"DE\",VLOOKUP($A123,'Style navne sprog'!$A:$I,2,FALSE),IF(Selection!$B$4=\"GB\",VLOOKUP($A123,'Style navne sprog'!$A:$I,4,FALSE),IF(Selection!$B$4=\"SE\",VLOOKUP($A123,'Style navne sprog'!$A:$I,3,FALSE),IF(Selection!$B$4=\"NO\",VLOOKUP($A123,'Style navne sprog'!$A:$I,5,FALSE),IF(Selection!$B$4=\"PL\",VLOOKUP($A123,'Style navne sprog'!$A:$I,7,FALSE)))))))","v":"Active vest | microfleece"},35.450000000000003,"","3XL-4XL",4]
["0812",{"$f":"IF(Selection!$B$4=\"DK\",VLOOKUP($A124,'Style navne sprog'!$A:$I,6,FALSE),IF(Selection!$B$4=\"DE\",VLOOKUP($A124,'Style navne sprog'!$A:$I,2,FALSE),IF(Selection!$B$4=\"GB\",VLOOKUP($A124,'Style navne sprog'!$A:$I,4,FALSE),IF(Selection!$B$4=\"SE\",VLOOKUP($A124,'Style navne sprog'!$A:$I,3,FALSE),IF(Selection!$B$4=\"NO\",VLOOKUP($A124,'Style navne sprog'!$A:$I,5,FALSE),IF(Selection!$B$4=\"PL\",VLOOKUP($A124,'Style navne sprog'!$A:$I,7,FALSE)))))))","v":"Active vest | microfleece | women"},35.450000000000003,"","3XL",4]
["0826",{"$f":"IF(Selection!$B$4=\"DK\",VLOOKUP($A125,'Style navne sprog'!$A:$I,6,FALSE),IF(Selection!$B$4=\"DE\",VLOOKUP($A125,'Style navne sprog'!$A:$I,2,FALSE),IF(Selection!$B$4=\"GB\",VLOOKUP($A125,'Style navne sprog'!$A:$I,4,FALSE),IF(Selection!$B$4=\"SE\",VLOOKUP($A125,'Style navne sprog'!$A:$I,3,FALSE),IF(Selection!$B$4=\"NO\",VLOOKUP($A125,'Style navne sprog'!$A:$I,5,FALSE),IF(Selection!$B$4=\"PL\",VLOOKUP($A125,'Style navne sprog'!$A:$I,7,FALSE)))))))","v":"Fleece jacket | quilted"},79.2,"","3XL-4XL",4]
["0827",{"$f":"IF(Selection!$B$4=\"DK\",VLOOKUP($A126,'Style navne sprog'!$A:$I,6,FALSE),IF(Selection!$B$4=\"DE\",VLOOKUP($A126,'Style navne sprog'!$A:$I,2,FALSE),IF(Selection!$B$4=\"GB\",VLOOKUP($A126,'Style navne sprog'!$A:$I,4,FALSE),IF(Selection!$B$4=\"SE\",VLOOKUP($A126,'Style navne sprog'!$A:$I,3,FALSE),IF(Selection!$B$4=\"NO\",VLOOKUP($A126,'Style navne sprog'!$A:$I,5,FALSE),IF(Selection!$B$4=\"PL\",VLOOKUP($A126,'Style navne sprog'!$A:$I,7,FALSE)))))))","v":"Fleece jacket | quilted | women"},79.2,"","4XL",4]
["0828",{"$f":"IF(Selection!$B$4=\"DK\",VLOOKUP($A127,'Style navne sprog'!$A:$I,6,FALSE),IF(Selection!$B$4=\"DE\",VLOOKUP($A127,'Style navne sprog'!$A:$I,2,FALSE),IF(Selection!$B$4=\"GB\",VLOOKUP($A127,'Style navne sprog'!$A:$I,4,FALSE),IF(Selection!$B$4=\"SE\",VLOOKUP($A127,'Style navne sprog'!$A:$I,3,FALSE),IF(Selection!$B$4=\"NO\",VLOOKUP($A127,'Style navne sprog'!$A:$I,5,FALSE),IF(Selection!$B$4=\"PL\",VLOOKUP($A127,'Style navne sprog'!$A:$I,7,FALSE)))))))","v":"Pile fleece jacket"},79.050000000000011,"","3XL",4]
["0829",{"$f":"IF(Selection!$B$4=\"DK\",VLOOKUP($A128,'Style navne sprog'!$A:$I,6,FALSE),IF(Selection!$B$4=\"DE\",VLOOKUP($A128,'Style navne sprog'!$A:$I,2,FALSE),IF(Selection!$B$4=\"GB\",VLOOKUP($A128,'Style navne sprog'!$A:$I,4,FALSE),IF(Selection!$B$4=\"SE\",VLOOKUP($A128,'Style navne sprog'!$A:$I,3,FALSE),IF(Selection!$B$4=\"NO\",VLOOKUP($A128,'Style navne sprog'!$A:$I,5,FALSE),IF(Selection!$B$4=\"PL\",VLOOKUP($A128,'Style navne sprog'!$A:$I,7,FALSE)))))))","v":"Pile fleece jacket I women"},79.050000000000011,"","3XL",4]
["0840",{"$f":"IF(Selection!$B$4=\"DK\",VLOOKUP($A129,'Style navne sprog'!$A:$I,6,FALSE),IF(Selection!$B$4=\"DE\",VLOOKUP($A129,'Style navne sprog'!$A:$I,2,FALSE),IF(Selection!$B$4=\"GB\",VLOOKUP($A129,'Style navne sprog'!$A:$I,4,FALSE),IF(Selection!$B$4=\"SE\",VLOOKUP($A129,'Style navne sprog'!$A:$I,3,FALSE),IF(Selection!$B$4=\"NO\",VLOOKUP($A129,'Style navne sprog'!$A:$I,5,FALSE),IF(Selection!$B$4=\"PL\",VLOOKUP($A129,'Style navne sprog'!$A:$I,7,FALSE)))))))","v":"Cardigan | stretch comfort"},80.400000000000006,"","3XL-4XL",4]
["0841",{"$f":"IF(Selection!$B$4=\"DK\",VLOOKUP($A130,'Style navne sprog'!$A:$I,6,FALSE),IF(Selection!$B$4=\"DE\",VLOOKUP($A130,'Style navne sprog'!$A:$I,2,FALSE),IF(Selection!$B$4=\"GB\",VLOOKUP($A130,'Style navne sprog'!$A:$I,4,FALSE),IF(Selection!$B$4=\"SE\",VLOOKUP($A130,'Style navne sprog'!$A:$I,3,FALSE),IF(Selection!$B$4=\"NO\",VLOOKUP($A130,'Style navne sprog'!$A:$I,5,FALSE),IF(Selection!$B$4=\"PL\",VLOOKUP($A130,'Style navne sprog'!$A:$I,7,FALSE)))))))","v":"Cardigan | stretch comfort | women"},80.400000000000006,"","3XL-4XL",4]
["0847",{"$f":"IF(Selection!$B$4=\"DK\",VLOOKUP($A131,'Style navne sprog'!$A:$I,6,FALSE),IF(Selection!$B$4=\"DE\",VLOOKUP($A131,'Style navne sprog'!$A:$I,2,FALSE),IF(Selection!$B$4=\"GB\",VLOOKUP($A131,'Style navne sprog'!$A:$I,4,FALSE),IF(Selection!$B$4=\"SE\",VLOOKUP($A131,'Style navne sprog'!$A:$I,3,FALSE),IF(Selection!$B$4=\"NO\",VLOOKUP($A131,'Style navne sprog'!$A:$I,5,FALSE),IF(Selection!$B$4=\"PL\",VLOOKUP($A131,'Style navne sprog'!$A:$I,7,FALSE)))))))","v":"Zip-n-Mix fleece | melange"},70.850000000000009,"","3XL-4XL",4]
["0848",{"$f":"IF(Selection!$B$4=\"DK\",VLOOKUP($A132,'Style navne sprog'!$A:$I,6,FALSE),IF(Selection!$B$4=\"DE\",VLOOKUP($A132,'Style navne sprog'!$A:$I,2,FALSE),IF(Selection!$B$4=\"GB\",VLOOKUP($A132,'Style navne sprog'!$A:$I,4,FALSE),IF(Selection!$B$4=\"SE\",VLOOKUP($A132,'Style navne sprog'!$A:$I,3,FALSE),IF(Selection!$B$4=\"NO\",VLOOKUP($A132,'Style navne sprog'!$A:$I,5,FALSE),IF(Selection!$B$4=\"PL\",VLOOKUP($A132,'Style navne sprog'!$A:$I,7,FALSE)))))))","v":"Zip-n-Mix fleece | melange | women"},70.850000000000009,"","3XL",4]
["0850",{"$f":"IF(Selection!$B$4=\"DK\",VLOOKUP($A133,'Style navne sprog'!$A:$I,6,FALSE),IF(Selection!$B$4=\"DE\",VLOOKUP($A133,'Style navne sprog'!$A:$I,2,FALSE),IF(Selection!$B$4=\"GB\",VLOOKUP($A133,'Style navne sprog'!$A:$I,4,FALSE),IF(Selection!$B$4=\"SE\",VLOOKUP($A133,'Style navne sprog'!$A:$I,3,FALSE),IF(Selection!$B$4=\"NO\",VLOOKUP($A133,'Style navne sprog'!$A:$I,5,FALSE),IF(Selection!$B$4=\"PL\",VLOOKUP($A133,'Style navne sprog'!$A:$I,7,FALSE)))))))","v":"Cardigan | knit fleece"},81.600000000000009,"","3XL",4]
["0851",{"$f":"IF(Selection!$B$4=\"DK\",VLOOKUP($A134,'Style navne sprog'!$A:$I,6,FALSE),IF(Selection!$B$4=\"DE\",VLOOKUP($A134,'Style navne sprog'!$A:$I,2,FALSE),IF(Selection!$B$4=\"GB\",VLOOKUP($A134,'Style navne sprog'!$A:$I,4,FALSE),IF(Selection!$B$4=\"SE\",VLOOKUP($A134,'Style navne sprog'!$A:$I,3,FALSE),IF(Selection!$B$4=\"NO\",VLOOKUP($A134,'Style navne sprog'!$A:$I,5,FALSE),IF(Selection!$B$4=\"PL\",VLOOKUP($A134,'Style navne sprog'!$A:$I,7,FALSE)))))))","v":"Cardigan | knit fleece | women"},81.600000000000009,"","3XL",4]
[]
[{"$f":"IF(Selection!$B$4=\"PL\",\"ODZIEZ WIERZCHNIA\",IF(Selection!$B$4=\"SE\",\"YTTERKLÄDER\",IF(Selection!$B$4=\"GB\",\"OUTERWEAR\",IF(Selection!$B$4=\"DE\",\"JACKEN & WESTEN\",IF(Selection!$B$4=\"NO\",\"YTTERTØY\",\"OVERTØJ\")))))","v":"OUTERWEAR"}]
["0712",{"$f":"IF(Selection!$B$4=\"DK\",VLOOKUP($A137,'Style navne sprog'!$A:$I,6,FALSE),IF(Selection!$B$4=\"DE\",VLOOKUP($A137,'Style navne sprog'!$A:$I,2,FALSE),IF(Selection!$B$4=\"GB\",VLOOKUP($A137,'Style navne sprog'!$A:$I,4,FALSE),IF(Selection!$B$4=\"SE\",VLOOKUP($A137,'Style navne sprog'!$A:$I,3,FALSE),IF(Selection!$B$4=\"NO\",VLOOKUP($A137,'Style navne sprog'!$A:$I,5,FALSE),IF(Selection!$B$4=\"PL\",VLOOKUP($A137,'Style navne sprog'!$A:$I,7,FALSE)))))))","v":"Zip-n-Mix shell Jacket"},160.95000000000002,"","3XL-6XL",4]
["0713",{"$f":"IF(Selection!$B$4=\"DK\",VLOOKUP($A138,'Style navne sprog'!$A:$I,6,FALSE),IF(Selection!$B$4=\"DE\",VLOOKUP($A138,'Style navne sprog'!$A:$I,2,FALSE),IF(Selection!$B$4=\"GB\",VLOOKUP($A138,'Style navne sprog'!$A:$I,4,FALSE),IF(Selection!$B$4=\"SE\",VLOOKUP($A138,'Style navne sprog'!$A:$I,3,FALSE),IF(Selection!$B$4=\"NO\",VLOOKUP($A138,'Style navne sprog'!$A:$I,5,FALSE),IF(Selection!$B$4=\"PL\",VLOOKUP($A138,'Style navne sprog'!$A:$I,7,FALSE)))))))","v":"Zip-n-Mix shell jacket | women"},160.95000000000002,"","3XL-6XL",4]
["0720",{"$f":"IF(Selection!$B$4=\"DK\",VLOOKUP($A139,'Style navne sprog'!$A:$I,6,FALSE),IF(Selection!$B$4=\"DE\",VLOOKUP($A139,'Style navne sprog'!$A:$I,2,FALSE),IF(Selection!$B$4=\"GB\",VLOOKUP($A139,'Style navne sprog'!$A:$I,4,FALSE),IF(Selection!$B$4=\"SE\",VLOOKUP($A139,'Style navne sprog'!$A:$I,3,FALSE),IF(Selection!$B$4=\"NO\",VLOOKUP($A139,'Style navne sprog'!$A:$I,5,FALSE),IF(Selection!$B$4=\"PL\",VLOOKUP($A139,'Style navne sprog'!$A:$I,7,FALSE)))))))","v":"Hybrid jacket"},93.850000000000009,"","3XL-4XL",4]
["0721",{"$f":"IF(Selection!$B$4=\"DK\",VLOOKUP($A140,'Style navne sprog'!$A:$I,6,FALSE),IF(Selection!$B$4=\"DE\",VLOOKUP($A140,'Style navne sprog'!$A:$I,2,FALSE),IF(Selection!$B$4=\"GB\",VLOOKUP($A140,'Style navne sprog'!$A:$I,4,FALSE),IF(Selection!$B$4=\"SE\",VLOOKUP($A140,'Style navne sprog'!$A:$I,3,FALSE),IF(Selection!$B$4=\"NO\",VLOOKUP($A140,'Style navne sprog'!$A:$I,5,FALSE),IF(Selection!$B$4=\"PL\",VLOOKUP($A140,'Style navne sprog'!$A:$I,7,FALSE)))))))","v":"Hybrid jacket | women"},93.850000000000009,"","3XL-4XL",4]
["0780",{"$f":"IF(Selection!$B$4=\"DK\",VLOOKUP($A141,'Style navne sprog'!$A:$I,6,FALSE),IF(Selection!$B$4=\"DE\",VLOOKUP($A141,'Style navne sprog'!$A:$I,2,FALSE),IF(Selection!$B$4=\"GB\",VLOOKUP($A141,'Style navne sprog'!$A:$I,4,FALSE),IF(Selection!$B$4=\"SE\",VLOOKUP($A141,'Style navne sprog'!$A:$I,3,FALSE),IF(Selection!$B$4=\"NO\",VLOOKUP($A141,'Style navne sprog'!$A:$I,5,FALSE),IF(Selection!$B$4=\"PL\",VLOOKUP($A141,'Style navne sprog'!$A:$I,7,FALSE)))))))","v":"Zip-n-Mix jacket | hybrid"},120.65,"","3XL-6XL",4]
["0781",{"$f":"IF(Selection!$B$4=\"DK\",VLOOKUP($A142,'Style navne sprog'!$A:$I,6,FALSE),IF(Selection!$B$4=\"DE\",VLOOKUP($A142,'Style navne sprog'!$A:$I,2,FALSE),IF(Selection!$B$4=\"GB\",VLOOKUP($A142,'Style navne sprog'!$A:$I,4,FALSE),IF(Selection!$B$4=\"SE\",VLOOKUP($A142,'Style navne sprog'!$A:$I,3,FALSE),IF(Selection!$B$4=\"NO\",VLOOKUP($A142,'Style navne sprog'!$A:$I,5,FALSE),IF(Selection!$B$4=\"PL\",VLOOKUP($A142,'Style navne sprog'!$A:$I,7,FALSE)))))))","v":"Zip-n-Mix jacket | hybrid | women"},120.65,"","3XL-6XL",4]
["0824",{"$f":"IF(Selection!$B$4=\"DK\",VLOOKUP($A143,'Style navne sprog'!$A:$I,6,FALSE),IF(Selection!$B$4=\"DE\",VLOOKUP($A143,'Style navne sprog'!$A:$I,2,FALSE),IF(Selection!$B$4=\"GB\",VLOOKUP($A143,'Style navne sprog'!$A:$I,4,FALSE),IF(Selection!$B$4=\"SE\",VLOOKUP($A143,'Style navne sprog'!$A:$I,3,FALSE),IF(Selection!$B$4=\"NO\",VLOOKUP($A143,'Style navne sprog'!$A:$I,5,FALSE),IF(Selection!$B$4=\"PL\",VLOOKUP($A143,'Style navne sprog'!$A:$I,7,FALSE)))))))","v":"Soft shell vest | functional"},61.6,"","3XL-6XL",4]
["0825",{"$f":"IF(Selection!$B$4=\"DK\",VLOOKUP($A144,'Style navne sprog'!$A:$I,6,FALSE),IF(Selection!$B$4=\"DE\",VLOOKUP($A144,'Style navne sprog'!$A:$I,2,FALSE),IF(Selection!$B$4=\"GB\",VLOOKUP($A144,'Style navne sprog'!$A:$I,4,FALSE),IF(Selection!$B$4=\"SE\",VLOOKUP($A144,'Style navne sprog'!$A:$I,3,FALSE),IF(Selection!$B$4=\"NO\",VLOOKUP($A144,'Style navne sprog'!$A:$I,5,FALSE),IF(Selection!$B$4=\"PL\",VLOOKUP($A144,'Style navne sprog'!$A:$I,7,FALSE)))))))","v":"Soft shell vest | functional | women"},61.6,"","3XL",4]
["0830",{"$f":"IF(Selection!$B$4=\"DK\",VLOOKUP($A145,'Style navne sprog'!$A:$I,6,FALSE),IF(Selection!$B$4=\"DE\",VLOOKUP($A145,'Style navne sprog'!$A:$I,2,FALSE),IF(Selection!$B$4=\"GB\",VLOOKUP($A145,'Style navne sprog'!$A:$I,4,FALSE),IF(Selection!$B$4=\"SE\",VLOOKUP($A145,'Style navne sprog'!$A:$I,3,FALSE),IF(Selection!$B$4=\"NO\",VLOOKUP($A145,'Style navne sprog'!$A:$I,5,FALSE),IF(Selection!$B$4=\"PL\",VLOOKUP($A145,'Style navne sprog'!$A:$I,7,FALSE)))))))","v":"Rain jacket | performance"},79.050000000000011,"","3XL",4]
["0831",{"$f":"IF(Selection!$B$4=\"DK\",VLOOKUP($A146,'Style navne sprog'!$A:$I,6,FALSE),IF(Selection!$B$4=\"DE\",VLOOKUP($A146,'Style navne sprog'!$A:$I,2,FALSE),IF(Selection!$B$4=\"GB\",VLOOKUP($A146,'Style navne sprog'!$A:$I,4,FALSE),IF(Selection!$B$4=\"SE\",VLOOKUP($A146,'Style navne sprog'!$A:$I,3,FALSE),IF(Selection!$B$4=\"NO\",VLOOKUP($A146,'Style navne sprog'!$A:$I,5,FALSE),IF(Selection!$B$4=\"PL\",VLOOKUP($A146,'Style navne sprog'!$A:$I,7,FALSE)))))))","v":"Rain jacket | performance | women"},79.050000000000011,"","3XL",4]
["0836",{"$f":"IF(Selection!$B$4=\"DK\",VLOOKUP($A147,'Style navne sprog'!$A:$I,6,FALSE),IF(Selection!$B$4=\"DE\",VLOOKUP($A147,'Style navne sprog'!$A:$I,2,FALSE),IF(Selection!$B$4=\"GB\",VLOOKUP($A147,'Style navne sprog'!$A:$I,4,FALSE),IF(Selection!$B$4=\"SE\",VLOOKUP($A147,'Style navne sprog'!$A:$I,3,FALSE),IF(Selection!$B$4=\"NO\",VLOOKUP($A147,'Style navne sprog'!$A:$I,5,FALSE),IF(Selection!$B$4=\"PL\",VLOOKUP($A147,'Style navne sprog'!$A:$I,7,FALSE)))))))","v":"Soft shell jacket | light"},87.100000000000009,"","3XL-6XL",4]
["0837",{"$f":"IF(Selection!$B$4=\"DK\",VLOOKUP($A148,'Style navne sprog'!$A:$I,6,FALSE),IF(Selection!$B$4=\"DE\",VLOOKUP($A148,'Style navne sprog'!$A:$I,2,FALSE),IF(Selection!$B$4=\"GB\",VLOOKUP($A148,'Style navne sprog'!$A:$I,4,FALSE),IF(Selection!$B$4=\"SE\",VLOOKUP($A148,'Style navne sprog'!$A:$I,3,FALSE),IF(Selection!$B$4=\"NO\",VLOOKUP($A148,'Style navne sprog'!$A:$I,5,FALSE),IF(Selection!$B$4=\"PL\",VLOOKUP($A148,'Style navne sprog'!$A:$I,7,FALSE)))))))","v":"Soft shell jacket | light | women"},87.100000000000009,"","3XL",4]
["0842",{"$f":"IF(Selection!$B$4=\"DK\",VLOOKUP($A149,'Style navne sprog'!$A:$I,6,FALSE),IF(Selection!$B$4=\"DE\",VLOOKUP($A149,'Style navne sprog'!$A:$I,2,FALSE),IF(Selection!$B$4=\"GB\",VLOOKUP($A149,'Style navne sprog'!$A:$I,4,FALSE),IF(Selection!$B$4=\"SE\",VLOOKUP($A149,'Style navne sprog'!$A:$I,3,FALSE),IF(Selection!$B$4=\"NO\",VLOOKUP($A149,'Style navne sprog'!$A:$I,5,FALSE),IF(Selection!$B$4=\"PL\",VLOOKUP($A149,'Style navne sprog'!$A:$I,7,FALSE)))))))","v":"Hooded winter jacket"},160.95000000000002,"","3XL-4XL",4]
["0843",{"$f":"IF(Selection!$B$4=\"DK\",VLOOKUP($A150,'Style navne sprog'!$A:$I,6,FALSE),IF(Selection!$B$4=\"DE\",VLOOKUP($A150,'Style navne sprog'!$A:$I,2,FALSE),IF(Selection!$B$4=\"GB\",VLOOKUP($A150,'Style navne sprog'!$A:$I,4,FALSE),IF(Selection!$B$4=\"SE\",VLOOKUP($A150,'Style navne sprog'!$A:$I,3,FALSE),IF(Selection!$B$4=\"NO\",VLOOKUP($A150,'Style navne sprog'!$A:$I,5,FALSE),IF(Selection!$B$4=\"PL\",VLOOKUP($A150,'Style navne sprog'!$A:$I,7,FALSE)))))))","v":"Hooded winter jacket | women"},160.95000000000002,"","3XL-4XL",4]
["0854",{"$f":"IF(Selection!$B$4=\"DK\",VLOOKUP($A151,'Style navne sprog'!$A:$I,6,FALSE),IF(Selection!$B$4=\"DE\",VLOOKUP($A151,'Style navne sprog'!$A:$I,2,FALSE),IF(Selection!$B$4=\"GB\",VLOOKUP($A151,'Style navne sprog'!$A:$I,4,FALSE),IF(Selection!$B$4=\"SE\",VLOOKUP($A151,'Style navne sprog'!$A:$I,3,FALSE),IF(Selection!$B$4=\"NO\",VLOOKUP($A151,'Style navne sprog'!$A:$I,5,FALSE),IF(Selection!$B$4=\"PL\",VLOOKUP($A151,'Style navne sprog'!$A:$I,7,FALSE)))))))","v":"CORE soft shell jacket"},65.650000000000006,"","3XL-6XL",4]
["0856",{"$f":"IF(Selection!$B$4=\"DK\",VLOOKUP($A152,'Style navne sprog'!$A:$I,6,FALSE),IF(Selection!$B$4=\"DE\",VLOOKUP($A152,'Style navne sprog'!$A:$I,2,FALSE),IF(Selection!$B$4=\"GB\",VLOOKUP($A152,'Style navne sprog'!$A:$I,4,FALSE),IF(Selection!$B$4=\"SE\",VLOOKUP($A152,'Style navne sprog'!$A:$I,3,FALSE),IF(Selection!$B$4=\"NO\",VLOOKUP($A152,'Style navne sprog'!$A:$I,5,FALSE),IF(Selection!$B$4=\"PL\",VLOOKUP($A152,'Style navne sprog'!$A:$I,7,FALSE)))))))","v":"CORE soft shell jacket| women"},65.650000000000006,"","3XL",4]
["0868",{"$f":"IF(Selection!$B$4=\"DK\",VLOOKUP($A153,'Style navne sprog'!$A:$I,6,FALSE),IF(Selection!$B$4=\"DE\",VLOOKUP($A153,'Style navne sprog'!$A:$I,2,FALSE),IF(Selection!$B$4=\"GB\",VLOOKUP($A153,'Style navne sprog'!$A:$I,4,FALSE),IF(Selection!$B$4=\"SE\",VLOOKUP($A153,'Style navne sprog'!$A:$I,3,FALSE),IF(Selection!$B$4=\"NO\",VLOOKUP($A153,'Style navne sprog'!$A:$I,5,FALSE),IF(Selection!$B$4=\"PL\",VLOOKUP($A153,'Style navne sprog'!$A:$I,7,FALSE)))))))","v":"Soft shell jacket | performance"},71,"","3XL-4XL",4]
["0869",{"$f":"IF(Selection!$B$4=\"DK\",VLOOKUP($A154,'Style navne sprog'!$A:$I,6,FALSE),IF(Selection!$B$4=\"DE\",VLOOKUP($A154,'Style navne sprog'!$A:$I,2,FALSE),IF(Selection!$B$4=\"GB\",VLOOKUP($A154,'Style navne sprog'!$A:$I,4,FALSE),IF(Selection!$B$4=\"SE\",VLOOKUP($A154,'Style navne sprog'!$A:$I,3,FALSE),IF(Selection!$B$4=\"NO\",VLOOKUP($A154,'Style navne sprog'!$A:$I,5,FALSE),IF(Selection!$B$4=\"PL\",VLOOKUP($A154,'Style navne sprog'!$A:$I,7,FALSE)))))))","v":"Soft shell jacket | performance | women"},71,"","3XL",4]
["0892",{"$f":"IF(Selection!$B$4=\"DK\",VLOOKUP($A155,'Style navne sprog'!$A:$I,6,FALSE),IF(Selection!$B$4=\"DE\",VLOOKUP($A155,'Style navne sprog'!$A:$I,2,FALSE),IF(Selection!$B$4=\"GB\",VLOOKUP($A155,'Style navne sprog'!$A:$I,4,FALSE),IF(Selection!$B$4=\"SE\",VLOOKUP($A155,'Style navne sprog'!$A:$I,3,FALSE),IF(Selection!$B$4=\"NO\",VLOOKUP($A155,'Style navne sprog'!$A:$I,5,FALSE),IF(Selection!$B$4=\"PL\",VLOOKUP($A155,'Style navne sprog'!$A:$I,7,FALSE)))))))","v":"Bodywarmer | stretch"},71,"","3XL",4]
["0893",{"$f":"IF(Selection!$B$4=\"DK\",VLOOKUP($A156,'Style navne sprog'!$A:$I,6,FALSE),IF(Selection!$B$4=\"DE\",VLOOKUP($A156,'Style navne sprog'!$A:$I,2,FALSE),IF(Selection!$B$4=\"GB\",VLOOKUP($A156,'Style navne sprog'!$A:$I,4,FALSE),IF(Selection!$B$4=\"SE\",VLOOKUP($A156,'Style navne sprog'!$A:$I,3,FALSE),IF(Selection!$B$4=\"NO\",VLOOKUP($A156,'Style navne sprog'!$A:$I,5,FALSE),IF(Selection!$B$4=\"PL\",VLOOKUP($A156,'Style navne sprog'!$A:$I,7,FALSE)))))))","v":"Bodywarmer | stretch | women"},71,"","3XL",4]
["0896",{"$f":"IF(Selection!$B$4=\"DK\",VLOOKUP($A157,'Style navne sprog'!$A:$I,6,FALSE),IF(Selection!$B$4=\"DE\",VLOOKUP($A157,'Style navne sprog'!$A:$I,2,FALSE),IF(Selection!$B$4=\"GB\",VLOOKUP($A157,'Style navne sprog'!$A:$I,4,FALSE),IF(Selection!$B$4=\"SE\",VLOOKUP($A157,'Style navne sprog'!$A:$I,3,FALSE),IF(Selection!$B$4=\"NO\",VLOOKUP($A157,'Style navne sprog'!$A:$I,5,FALSE),IF(Selection!$B$4=\"PL\",VLOOKUP($A157,'Style navne sprog'!$A:$I,7,FALSE)))))))","v":"Padded jacket | stretch"},81.75,"","3XL",4]
["0897",{"$f":"IF(Selection!$B$4=\"DK\",VLOOKUP($A158,'Style navne sprog'!$A:$I,6,FALSE),IF(Selection!$B$4=\"DE\",VLOOKUP($A158,'Style navne sprog'!$A:$I,2,FALSE),IF(Selection!$B$4=\"GB\",VLOOKUP($A158,'Style navne sprog'!$A:$I,4,FALSE),IF(Selection!$B$4=\"SE\",VLOOKUP($A158,'Style navne sprog'!$A:$I,3,FALSE),IF(Selection!$B$4=\"NO\",VLOOKUP($A158,'Style navne sprog'!$A:$I,5,FALSE),IF(Selection!$B$4=\"PL\",VLOOKUP($A158,'Style navne sprog'!$A:$I,7,FALSE)))))))","v":"Padded jacket | stretch | women"},81.75,"","3XL",4]
["0898",{"$f":"IF(Selection!$B$4=\"DK\",VLOOKUP($A159,'Style navne sprog'!$A:$I,6,FALSE),IF(Selection!$B$4=\"DE\",VLOOKUP($A159,'Style navne sprog'!$A:$I,2,FALSE),IF(Selection!$B$4=\"GB\",VLOOKUP($A159,'Style navne sprog'!$A:$I,4,FALSE),IF(Selection!$B$4=\"SE\",VLOOKUP($A159,'Style navne sprog'!$A:$I,3,FALSE),IF(Selection!$B$4=\"NO\",VLOOKUP($A159,'Style navne sprog'!$A:$I,5,FALSE),IF(Selection!$B$4=\"PL\",VLOOKUP($A159,'Style navne sprog'!$A:$I,7,FALSE)))))))","v":"Soft shell jacket | winter"},118,"","3XL",4]
["0899",{"$f":"IF(Selection!$B$4=\"DK\",VLOOKUP($A160,'Style navne sprog'!$A:$I,6,FALSE),IF(Selection!$B$4=\"DE\",VLOOKUP($A160,'Style navne sprog'!$A:$I,2,FALSE),IF(Selection!$B$4=\"GB\",VLOOKUP($A160,'Style navne sprog'!$A:$I,4,FALSE),IF(Selection!$B$4=\"SE\",VLOOKUP($A160,'Style navne sprog'!$A:$I,3,FALSE),IF(Selection!$B$4=\"NO\",VLOOKUP($A160,'Style navne sprog'!$A:$I,5,FALSE),IF(Selection!$B$4=\"PL\",VLOOKUP($A160,'Style navne sprog'!$A:$I,7,FALSE)))))))","v":"Soft shell jacket | winter | women"},118,"","3XL",4]
[null,null,"","",null,""]
[{"$f":"IF(Selection!$B$4=\"PL\",\"SPODNIE\",IF(Selection!$B$4=\"SE\",\"BYXOR\",IF(Selection!$B$4=\"GB\",\"TROUSERS\",IF(Selection!$B$4=\"DE\",\"HOSEN\",\"BUKSER\"))))","v":"TROUSERS"}]
["0661",{"$f":"IF(Selection!$B$4=\"DK\",VLOOKUP($A163,'Style navne sprog'!$A:$I,6,FALSE),IF(Selection!$B$4=\"DE\",VLOOKUP($A163,'Style navne sprog'!$A:$I,2,FALSE),IF(Selection!$B$4=\"GB\",VLOOKUP($A163,'Style navne sprog'!$A:$I,4,FALSE),IF(Selection!$B$4=\"SE\",VLOOKUP($A163,'Style navne sprog'!$A:$I,3,FALSE),IF(Selection!$B$4=\"NO\",VLOOKUP($A163,'Style navne sprog'!$A:$I,5,FALSE),IF(Selection!$B$4=\"PL\",VLOOKUP($A163,'Style navne sprog'!$A:$I,7,FALSE)))))))","v":"Classic sweatpants | unisex"},22.700000000000003,"","3XL-4XL",2.7]
["0714",{"$f":"IF(Selection!$B$4=\"DK\",VLOOKUP($A164,'Style navne sprog'!$A:$I,6,FALSE),IF(Selection!$B$4=\"DE\",VLOOKUP($A164,'Style navne sprog'!$A:$I,2,FALSE),IF(Selection!$B$4=\"GB\",VLOOKUP($A164,'Style navne sprog'!$A:$I,4,FALSE),IF(Selection!$B$4=\"SE\",VLOOKUP($A164,'Style navne sprog'!$A:$I,3,FALSE),IF(Selection!$B$4=\"NO\",VLOOKUP($A164,'Style navne sprog'!$A:$I,5,FALSE),IF(Selection!$B$4=\"PL\",VLOOKUP($A164,'Style navne sprog'!$A:$I,7,FALSE)))))))","v":"Zip-n-Mix pants | unisex"},87.100000000000009,"","3XL-6XL",2.7]
["0902",{"$f":"IF(Selection!$B$4=\"DK\",VLOOKUP($A165,'Style navne sprog'!$A:$I,6,FALSE),IF(Selection!$B$4=\"DE\",VLOOKUP($A165,'Style navne sprog'!$A:$I,2,FALSE),IF(Selection!$B$4=\"GB\",VLOOKUP($A165,'Style navne sprog'!$A:$I,4,FALSE),IF(Selection!$B$4=\"SE\",VLOOKUP($A165,'Style navne sprog'!$A:$I,3,FALSE),IF(Selection!$B$4=\"NO\",VLOOKUP($A165,'Style navne sprog'!$A:$I,5,FALSE),IF(Selection!$B$4=\"PL\",VLOOKUP($A165,'Style navne sprog'!$A:$I,7,FALSE)))))))","v":"Hybrid stretch pants"},93.550000000000011,"","3XL-6XL",4]
["0903",{"$f":"IF(Selection!$B$4=\"DK\",VLOOKUP($A166,'Style navne sprog'!$A:$I,6,FALSE),IF(Selection!$B$4=\"DE\",VLOOKUP($A166,'Style navne sprog'!$A:$I,2,FALSE),IF(Selection!$B$4=\"GB\",VLOOKUP($A166,'Style navne sprog'!$A:$I,4,FALSE),IF(Selection!$B$4=\"SE\",VLOOKUP($A166,'Style navne sprog'!$A:$I,3,FALSE),IF(Selection!$B$4=\"NO\",VLOOKUP($A166,'Style navne sprog'!$A:$I,5,FALSE),IF(Selection!$B$4=\"PL\",VLOOKUP($A166,'Style navne sprog'!$A:$I,7,FALSE)))))))","v":"Hybrid stretch pants | women"},93.550000000000011,"","3XL-6XL",4]
["0907",{"$f":"IF(Selection!$B$4=\"DK\",VLOOKUP($A167,'Style navne sprog'!$A:$I,6,FALSE),IF(Selection!$B$4=\"DE\",VLOOKUP($A167,'Style navne sprog'!$A:$I,2,FALSE),IF(Selection!$B$4=\"GB\",VLOOKUP($A167,'Style navne sprog'!$A:$I,4,FALSE),IF(Selection!$B$4=\"SE\",VLOOKUP($A167,'Style navne sprog'!$A:$I,3,FALSE),IF(Selection!$B$4=\"NO\",VLOOKUP($A167,'Style navne sprog'!$A:$I,5,FALSE),IF(Selection!$B$4=\"PL\",VLOOKUP($A167,'Style navne sprog'!$A:$I,7,FALSE)))))))","v":"Stretch pants | multifunctional | unisex"},70.05,"","3XL-6XL",4]
["0910",{"$f":"IF(Selection!$B$4=\"DK\",VLOOKUP($A168,'Style navne sprog'!$A:$I,6,FALSE),IF(Selection!$B$4=\"DE\",VLOOKUP($A168,'Style navne sprog'!$A:$I,2,FALSE),IF(Selection!$B$4=\"GB\",VLOOKUP($A168,'Style navne sprog'!$A:$I,4,FALSE),IF(Selection!$B$4=\"SE\",VLOOKUP($A168,'Style navne sprog'!$A:$I,3,FALSE),IF(Selection!$B$4=\"NO\",VLOOKUP($A168,'Style navne sprog'!$A:$I,5,FALSE),IF(Selection!$B$4=\"PL\",VLOOKUP($A168,'Style navne sprog'!$A:$I,7,FALSE)))))))","v":"CORE stretch pants"},93.850000000000009,"","3XL-4XL",4]
["0911",{"$f":"IF(Selection!$B$4=\"DK\",VLOOKUP($A169,'Style navne sprog'!$A:$I,6,FALSE),IF(Selection!$B$4=\"DE\",VLOOKUP($A169,'Style navne sprog'!$A:$I,2,FALSE),IF(Selection!$B$4=\"GB\",VLOOKUP($A169,'Style navne sprog'!$A:$I,4,FALSE),IF(Selection!$B$4=\"SE\",VLOOKUP($A169,'Style navne sprog'!$A:$I,3,FALSE),IF(Selection!$B$4=\"NO\",VLOOKUP($A169,'Style navne sprog'!$A:$I,5,FALSE),IF(Selection!$B$4=\"PL\",VLOOKUP($A169,'Style navne sprog'!$A:$I,7,FALSE)))))))","v":"CORE stretch pants | women"},93.850000000000009,"","3XL-4XL",4]
["0912",{"$f":"IF(Selection!$B$4=\"DK\",VLOOKUP($A170,'Style navne sprog'!$A:$I,6,FALSE),IF(Selection!$B$4=\"DE\",VLOOKUP($A170,'Style navne sprog'!$A:$I,2,FALSE),IF(Selection!$B$4=\"GB\",VLOOKUP($A170,'Style navne sprog'!$A:$I,4,FALSE),IF(Selection!$B$4=\"SE\",VLOOKUP($A170,'Style navne sprog'!$A:$I,3,FALSE),IF(Selection!$B$4=\"NO\",VLOOKUP($A170,'Style navne sprog'!$A:$I,5,FALSE),IF(Selection!$B$4=\"PL\",VLOOKUP($A170,'Style navne sprog'!$A:$I,7,FALSE)))))))","v":"CORE stretch shorts"},84.45,"","3XL-4XL",4]
["0913",{"$f":"IF(Selection!$B$4=\"DK\",VLOOKUP($A171,'Style navne sprog'!$A:$I,6,FALSE),IF(Selection!$B$4=\"DE\",VLOOKUP($A171,'Style navne sprog'!$A:$I,2,FALSE),IF(Selection!$B$4=\"GB\",VLOOKUP($A171,'Style navne sprog'!$A:$I,4,FALSE),IF(Selection!$B$4=\"SE\",VLOOKUP($A171,'Style navne sprog'!$A:$I,3,FALSE),IF(Selection!$B$4=\"NO\",VLOOKUP($A171,'Style navne sprog'!$A:$I,5,FALSE),IF(Selection!$B$4=\"PL\",VLOOKUP($A171,'Style navne sprog'!$A:$I,7,FALSE)))))))","v":"CORE stretch shorts | women"},84.45,"","3XL-4XL",4]
["0914",{"$f":"IF(Selection!$B$4=\"DK\",VLOOKUP($A172,'Style navne sprog'!$A:$I,6,FALSE),IF(Selection!$B$4=\"DE\",VLOOKUP($A172,'Style navne sprog'!$A:$I,2,FALSE),IF(Selection!$B$4=\"GB\",VLOOKUP($A172,'Style navne sprog'!$A:$I,4,FALSE),IF(Selection!$B$4=\"SE\",VLOOKUP($A172,'Style navne sprog'!$A:$I,3,FALSE),IF(Selection!$B$4=\"NO\",VLOOKUP($A172,'Style navne sprog'!$A:$I,5,FALSE),IF(Selection!$B$4=\"PL\",VLOOKUP($A172,'Style navne sprog'!$A:$I,7,FALSE)))))))","v":"Cargo stretch pants | unisex"},93.850000000000009,"","3XL-4XL",4]
[null,null,"","",null,""]
[{"$f":"IF(Selection!$B$4=\"PL\",\"DZIECI\",IF(Selection!$B$4=\"SE\",\"BARN\",IF(Selection!$B$4=\"GB\",\"CHILDREN\",IF(Selection!$B$4=\"DE\",\"KINDER\",\"BØRN\"))))","v":"CHILDREN"}]
["40500",{"$f":"IF(Selection!$B$4=\"DK\",VLOOKUP($A175,'Style navne sprog'!$A:$I,6,FALSE),IF(Selection!$B$4=\"DE\",VLOOKUP($A175,'Style navne sprog'!$A:$I,2,FALSE),IF(Selection!$B$4=\"GB\",VLOOKUP($A175,'Style navne sprog'!$A:$I,4,FALSE),IF(Selection!$B$4=\"SE\",VLOOKUP($A175,'Style navne sprog'!$A:$I,3,FALSE),IF(Selection!$B$4=\"NO\",VLOOKUP($A175,'Style navne sprog'!$A:$I,5,FALSE),IF(Selection!$B$4=\"PL\",VLOOKUP($A175,'Style navne sprog'!$A:$I,7,FALSE)))))))","v":"GAME T-shirt | children"},7.0500000000000007,6.4,"",""]
["40510",{"$f":"IF(Selection!$B$4=\"DK\",VLOOKUP($A176,'Style navne sprog'!$A:$I,6,FALSE),IF(Selection!$B$4=\"DE\",VLOOKUP($A176,'Style navne sprog'!$A:$I,2,FALSE),IF(Selection!$B$4=\"GB\",VLOOKUP($A176,'Style navne sprog'!$A:$I,4,FALSE),IF(Selection!$B$4=\"SE\",VLOOKUP($A176,'Style navne sprog'!$A:$I,3,FALSE),IF(Selection!$B$4=\"NO\",VLOOKUP($A176,'Style navne sprog'!$A:$I,5,FALSE),IF(Selection!$B$4=\"PL\",VLOOKUP($A176,'Style navne sprog'!$A:$I,7,FALSE)))))))","v":"T-TIME® T-shirt | children"},9.8000000000000007,9.15,"",""]
["40552",{"$f":"IF(Selection!$B$4=\"DK\",VLOOKUP($A177,'Style navne sprog'!$A:$I,6,FALSE),IF(Selection!$B$4=\"DE\",VLOOKUP($A177,'Style navne sprog'!$A:$I,2,FALSE),IF(Selection!$B$4=\"GB\",VLOOKUP($A177,'Style navne sprog'!$A:$I,4,FALSE),IF(Selection!$B$4=\"SE\",VLOOKUP($A177,'Style navne sprog'!$A:$I,3,FALSE),IF(Selection!$B$4=\"NO\",VLOOKUP($A177,'Style navne sprog'!$A:$I,5,FALSE),IF(Selection!$B$4=\"PL\",VLOOKUP($A177,'Style navne sprog'!$A:$I,7,FALSE)))))))","v":"Organic T-shirt | children"},11.05,10.4,"",""]
["40634",{"$f":"IF(Selection!$B$4=\"DK\",VLOOKUP($A178,'Style navne sprog'!$A:$I,6,FALSE),IF(Selection!$B$4=\"DE\",VLOOKUP($A178,'Style navne sprog'!$A:$I,2,FALSE),IF(Selection!$B$4=\"GB\",VLOOKUP($A178,'Style navne sprog'!$A:$I,4,FALSE),IF(Selection!$B$4=\"SE\",VLOOKUP($A178,'Style navne sprog'!$A:$I,3,FALSE),IF(Selection!$B$4=\"NO\",VLOOKUP($A178,'Style navne sprog'!$A:$I,5,FALSE),IF(Selection!$B$4=\"PL\",VLOOKUP($A178,'Style navne sprog'!$A:$I,7,FALSE)))))))","v":"CORE sweatshirt | children"},22.3,"","",""]
["40636",{"$f":"IF(Selection!$B$4=\"DK\",VLOOKUP($A179,'Style navne sprog'!$A:$I,6,FALSE),IF(Selection!$B$4=\"DE\",VLOOKUP($A179,'Style navne sprog'!$A:$I,2,FALSE),IF(Selection!$B$4=\"GB\",VLOOKUP($A179,'Style navne sprog'!$A:$I,4,FALSE),IF(Selection!$B$4=\"SE\",VLOOKUP($A179,'Style navne sprog'!$A:$I,3,FALSE),IF(Selection!$B$4=\"NO\",VLOOKUP($A179,'Style navne sprog'!$A:$I,5,FALSE),IF(Selection!$B$4=\"PL\",VLOOKUP($A179,'Style navne sprog'!$A:$I,7,FALSE)))))))","v":"CORE hoodie | children"},27.5,"","",""]
["40638",{"$f":"IF(Selection!$B$4=\"DK\",VLOOKUP($A180,'Style navne sprog'!$A:$I,6,FALSE),IF(Selection!$B$4=\"DE\",VLOOKUP($A180,'Style navne sprog'!$A:$I,2,FALSE),IF(Selection!$B$4=\"GB\",VLOOKUP($A180,'Style navne sprog'!$A:$I,4,FALSE),IF(Selection!$B$4=\"SE\",VLOOKUP($A180,'Style navne sprog'!$A:$I,3,FALSE),IF(Selection!$B$4=\"NO\",VLOOKUP($A180,'Style navne sprog'!$A:$I,5,FALSE),IF(Selection!$B$4=\"PL\",VLOOKUP($A180,'Style navne sprog'!$A:$I,7,FALSE)))))))","v":"CORE zip hoodie | children"},27.5,"","",""]
["40836",{"$f":"IF(Selection!$B$4=\"DK\",VLOOKUP($A181,'Style navne sprog'!$A:$I,6,FALSE),IF(Selection!$B$4=\"DE\",VLOOKUP($A181,'Style navne sprog'!$A:$I,2,FALSE),IF(Selection!$B$4=\"GB\",VLOOKUP($A181,'Style navne sprog'!$A:$I,4,FALSE),IF(Selection!$B$4=\"SE\",VLOOKUP($A181,'Style navne sprog'!$A:$I,3,FALSE),IF(Selection!$B$4=\"NO\",VLOOKUP($A181,'Style navne sprog'!$A:$I,5,FALSE),IF(Selection!$B$4=\"PL\",VLOOKUP($A181,'Style navne sprog'!$A:$I,7,FALSE)))))))","v":"Soft shell jacket | light | children"},61.35,"","",""]
["42030",{"$f":"IF(Selection!$B$4=\"DK\",VLOOKUP($A182,'Style navne sprog'!$A:$I,6,FALSE),IF(Selection!$B$4=\"DE\",VLOOKUP($A182,'Style navne sprog'!$A:$I,2,FALSE),IF(Selection!$B$4=\"GB\",VLOOKUP($A182,'Style navne sprog'!$A:$I,4,FALSE),IF(Selection!$B$4=\"SE\",VLOOKUP($A182,'Style navne sprog'!$A:$I,3,FALSE),IF(Selection!$B$4=\"NO\",VLOOKUP($A182,'Style navne sprog'!$A:$I,5,FALSE),IF(Selection!$B$4=\"PL\",VLOOKUP($A182,'Style navne sprog'!$A:$I,7,FALSE)))))))","v":"YES Active T-shirt | children"},10.200000000000001,9.5500000000000007,"",""]
[null,null,"","",null,""]
[{"$f":"IF(Selection!$B$4=\"PL\",\"AKCESORIA\",IF(Selection!$B$4=\"SE\",\"ACCESSOARER\",IF(Selection!$B$4=\"GB\",\"ACCESSORIES\",IF(Selection!$B$4=\"DE\",\"ACCESSORIES\",\"ACCESSORIES\"))))","v":"ACCESSORIES"}]
["0010",{"$f":"IF(Selection!$B$4=\"DK\",VLOOKUP($A185,'Style navne sprog'!$A:$I,6,FALSE),IF(Selection!$B$4=\"DE\",VLOOKUP($A185,'Style navne sprog'!$A:$I,2,FALSE),IF(Selection!$B$4=\"GB\",VLOOKUP($A185,'Style navne sprog'!$A:$I,4,FALSE),IF(Selection!$B$4=\"SE\",VLOOKUP($A185,'Style navne sprog'!$A:$I,3,FALSE),IF(Selection!$B$4=\"NO\",VLOOKUP($A185,'Style navne sprog'!$A:$I,5,FALSE),IF(Selection!$B$4=\"PL\",VLOOKUP($A185,'Style navne sprog'!$A:$I,7,FALSE)))))))","v":"Towel 50x100"},11.950000000000001,"","",""]
["0011",{"$f":"IF(Selection!$B$4=\"DK\",VLOOKUP($A186,'Style navne sprog'!$A:$I,6,FALSE),IF(Selection!$B$4=\"DE\",VLOOKUP($A186,'Style navne sprog'!$A:$I,2,FALSE),IF(Selection!$B$4=\"GB\",VLOOKUP($A186,'Style navne sprog'!$A:$I,4,FALSE),IF(Selection!$B$4=\"SE\",VLOOKUP($A186,'Style navne sprog'!$A:$I,3,FALSE),IF(Selection!$B$4=\"NO\",VLOOKUP($A186,'Style navne sprog'!$A:$I,5,FALSE),IF(Selection!$B$4=\"PL\",VLOOKUP($A186,'Style navne sprog'!$A:$I,7,FALSE)))))))","v":"Bath towel 70x140"},19.650000000000002,"","",""]
["0036",{"$f":"IF(Selection!$B$4=\"DK\",VLOOKUP($A187,'Style navne sprog'!$A:$I,6,FALSE),IF(Selection!$B$4=\"DE\",VLOOKUP($A187,'Style navne sprog'!$A:$I,2,FALSE),IF(Selection!$B$4=\"GB\",VLOOKUP($A187,'Style navne sprog'!$A:$I,4,FALSE),IF(Selection!$B$4=\"SE\",VLOOKUP($A187,'Style navne sprog'!$A:$I,3,FALSE),IF(Selection!$B$4=\"NO\",VLOOKUP($A187,'Style navne sprog'!$A:$I,5,FALSE),IF(Selection!$B$4=\"PL\",VLOOKUP($A187,'Style navne sprog'!$A:$I,7,FALSE)))))))","v":"Hat | stretch"},8.4500000000000011,"","",""]
["0038",{"$f":"IF(Selection!$B$4=\"DK\",VLOOKUP($A188,'Style navne sprog'!$A:$I,6,FALSE),IF(Selection!$B$4=\"DE\",VLOOKUP($A188,'Style navne sprog'!$A:$I,2,FALSE),IF(Selection!$B$4=\"GB\",VLOOKUP($A188,'Style navne sprog'!$A:$I,4,FALSE),IF(Selection!$B$4=\"SE\",VLOOKUP($A188,'Style navne sprog'!$A:$I,3,FALSE),IF(Selection!$B$4=\"NO\",VLOOKUP($A188,'Style navne sprog'!$A:$I,5,FALSE),IF(Selection!$B$4=\"PL\",VLOOKUP($A188,'Style navne sprog'!$A:$I,7,FALSE)))))))","v":"Neck warmer | stretch"},7.65,"","",""]
["0040",{"$f":"IF(Selection!$B$4=\"DK\",VLOOKUP($A189,'Style navne sprog'!$A:$I,6,FALSE),IF(Selection!$B$4=\"DE\",VLOOKUP($A189,'Style navne sprog'!$A:$I,2,FALSE),IF(Selection!$B$4=\"GB\",VLOOKUP($A189,'Style navne sprog'!$A:$I,4,FALSE),IF(Selection!$B$4=\"SE\",VLOOKUP($A189,'Style navne sprog'!$A:$I,3,FALSE),IF(Selection!$B$4=\"NO\",VLOOKUP($A189,'Style navne sprog'!$A:$I,5,FALSE),IF(Selection!$B$4=\"PL\",VLOOKUP($A189,'Style navne sprog'!$A:$I,7,FALSE)))))))","v":"Soft neck warmer"},11.950000000000001,"","",""]
["0042",{"$f":"IF(Selection!$B$4=\"DK\",VLOOKUP($A190,'Style navne sprog'!$A:$I,6,FALSE),IF(Selection!$B$4=\"DE\",VLOOKUP($A190,'Style navne sprog'!$A:$I,2,FALSE),IF(Selection!$B$4=\"GB\",VLOOKUP($A190,'Style navne sprog'!$A:$I,4,FALSE),IF(Selection!$B$4=\"SE\",VLOOKUP($A190,'Style navne sprog'!$A:$I,3,FALSE),IF(Selection!$B$4=\"NO\",VLOOKUP($A190,'Style navne sprog'!$A:$I,5,FALSE),IF(Selection!$B$4=\"PL\",VLOOKUP($A190,'Style navne sprog'!$A:$I,7,FALSE)))))))","v":"Knitted hat"},9.0500000000000007,"","",""]
["0045",{"$f":"IF(Selection!$B$4=\"DK\",VLOOKUP($A191,'Style navne sprog'!$A:$I,6,FALSE),IF(Selection!$B$4=\"DE\",VLOOKUP($A191,'Style navne sprog'!$A:$I,2,FALSE),IF(Selection!$B$4=\"GB\",VLOOKUP($A191,'Style navne sprog'!$A:$I,4,FALSE),IF(Selection!$B$4=\"SE\",VLOOKUP($A191,'Style navne sprog'!$A:$I,3,FALSE),IF(Selection!$B$4=\"NO\",VLOOKUP($A191,'Style navne sprog'!$A:$I,5,FALSE),IF(Selection!$B$4=\"PL\",VLOOKUP($A191,'Style navne sprog'!$A:$I,7,FALSE)))))))","v":"Stretch hat"},10.600000000000001,"","",""]
["0044",{"$f":"IF(Selection!$B$4=\"DK\",VLOOKUP($A192,'Style navne sprog'!$A:$I,6,FALSE),IF(Selection!$B$4=\"DE\",VLOOKUP($A192,'Style navne sprog'!$A:$I,2,FALSE),IF(Selection!$B$4=\"GB\",VLOOKUP($A192,'Style navne sprog'!$A:$I,4,FALSE),IF(Selection!$B$4=\"SE\",VLOOKUP($A192,'Style navne sprog'!$A:$I,3,FALSE),IF(Selection!$B$4=\"NO\",VLOOKUP($A192,'Style navne sprog'!$A:$I,5,FALSE),IF(Selection!$B$4=\"PL\",VLOOKUP($A192,'Style navne sprog'!$A:$I,7,FALSE)))))))","v":"Knitted hat | lining"},11.15,"","",""]
["0050",{"$f":"IF(Selection!$B$4=\"DK\",VLOOKUP($A193,'Style navne sprog'!$A:$I,6,FALSE),IF(Selection!$B$4=\"DE\",VLOOKUP($A193,'Style navne sprog'!$A:$I,2,FALSE),IF(Selection!$B$4=\"GB\",VLOOKUP($A193,'Style navne sprog'!$A:$I,4,FALSE),IF(Selection!$B$4=\"SE\",VLOOKUP($A193,'Style navne sprog'!$A:$I,3,FALSE),IF(Selection!$B$4=\"NO\",VLOOKUP($A193,'Style navne sprog'!$A:$I,5,FALSE),IF(Selection!$B$4=\"PL\",VLOOKUP($A193,'Style navne sprog'!$A:$I,7,FALSE)))))))","v":"Urban cap"},9.25,"","",""]
["0052",{"$f":"IF(Selection!$B$4=\"DK\",VLOOKUP($A194,'Style navne sprog'!$A:$I,6,FALSE),IF(Selection!$B$4=\"DE\",VLOOKUP($A194,'Style navne sprog'!$A:$I,2,FALSE),IF(Selection!$B$4=\"GB\",VLOOKUP($A194,'Style navne sprog'!$A:$I,4,FALSE),IF(Selection!$B$4=\"SE\",VLOOKUP($A194,'Style navne sprog'!$A:$I,3,FALSE),IF(Selection!$B$4=\"NO\",VLOOKUP($A194,'Style navne sprog'!$A:$I,5,FALSE),IF(Selection!$B$4=\"PL\",VLOOKUP($A194,'Style navne sprog'!$A:$I,7,FALSE)))))))","v":"Golf cap"},4.95,"","",""]
["0054",{"$f":"IF(Selection!$B$4=\"DK\",VLOOKUP($A195,'Style navne sprog'!$A:$I,6,FALSE),IF(Selection!$B$4=\"DE\",VLOOKUP($A195,'Style navne sprog'!$A:$I,2,FALSE),IF(Selection!$B$4=\"GB\",VLOOKUP($A195,'Style navne sprog'!$A:$I,4,FALSE),IF(Selection!$B$4=\"SE\",VLOOKUP($A195,'Style navne sprog'!$A:$I,3,FALSE),IF(Selection!$B$4=\"NO\",VLOOKUP($A195,'Style navne sprog'!$A:$I,5,FALSE),IF(Selection!$B$4=\"PL\",VLOOKUP($A195,'Style navne sprog'!$A:$I,7,FALSE)))))))","v":"Twill cap"},6.5,"","",""]
["0060",{"$f":"IF(Selection!$B$4=\"DK\",VLOOKUP($A196,'Style navne sprog'!$A:$I,6,FALSE),IF(Selection!$B$4=\"DE\",VLOOKUP($A196,'Style navne sprog'!$A:$I,2,FALSE),IF(Selection!$B$4=\"GB\",VLOOKUP($A196,'Style navne sprog'!$A:$I,4,FALSE),IF(Selection!$B$4=\"SE\",VLOOKUP($A196,'Style navne sprog'!$A:$I,3,FALSE),IF(Selection!$B$4=\"NO\",VLOOKUP($A196,'Style navne sprog'!$A:$I,5,FALSE),IF(Selection!$B$4=\"PL\",VLOOKUP($A196,'Style navne sprog'!$A:$I,7,FALSE)))))))","v":"Classic canvas bucket hat"},9.25,"","",""]
["0068",{"$f":"IF(Selection!$B$4=\"DK\",VLOOKUP($A197,'Style navne sprog'!$A:$I,6,FALSE),IF(Selection!$B$4=\"DE\",VLOOKUP($A197,'Style navne sprog'!$A:$I,2,FALSE),IF(Selection!$B$4=\"GB\",VLOOKUP($A197,'Style navne sprog'!$A:$I,4,FALSE),IF(Selection!$B$4=\"SE\",VLOOKUP($A197,'Style navne sprog'!$A:$I,3,FALSE),IF(Selection!$B$4=\"NO\",VLOOKUP($A197,'Style navne sprog'!$A:$I,5,FALSE),IF(Selection!$B$4=\"PL\",VLOOKUP($A197,'Style navne sprog'!$A:$I,7,FALSE)))))))","v":"Cap | stretch"},9.0500000000000007,"","",""]
["0073",{"$f":"IF(Selection!$B$4=\"DK\",VLOOKUP($A198,'Style navne sprog'!$A:$I,6,FALSE),IF(Selection!$B$4=\"DE\",VLOOKUP($A198,'Style navne sprog'!$A:$I,2,FALSE),IF(Selection!$B$4=\"GB\",VLOOKUP($A198,'Style navne sprog'!$A:$I,4,FALSE),IF(Selection!$B$4=\"SE\",VLOOKUP($A198,'Style navne sprog'!$A:$I,3,FALSE),IF(Selection!$B$4=\"NO\",VLOOKUP($A198,'Style navne sprog'!$A:$I,5,FALSE),IF(Selection!$B$4=\"PL\",VLOOKUP($A198,'Style navne sprog'!$A:$I,7,FALSE)))))))","v":"Apron"},19.200000000000003,"","",""]
["0074",{"$f":"IF(Selection!$B$4=\"DK\",VLOOKUP($A199,'Style navne sprog'!$A:$I,6,FALSE),IF(Selection!$B$4=\"DE\",VLOOKUP($A199,'Style navne sprog'!$A:$I,2,FALSE),IF(Selection!$B$4=\"GB\",VLOOKUP($A199,'Style navne sprog'!$A:$I,4,FALSE),IF(Selection!$B$4=\"SE\",VLOOKUP($A199,'Style navne sprog'!$A:$I,3,FALSE),IF(Selection!$B$4=\"NO\",VLOOKUP($A199,'Style navne sprog'!$A:$I,5,FALSE),IF(Selection!$B$4=\"PL\",VLOOKUP($A199,'Style navne sprog'!$A:$I,7,FALSE)))))))","v":"Serving apron"},19.200000000000003,"","",""]
["0170",{"$f":"IF(Selection!$B$4=\"DK\",VLOOKUP($A200,'Style navne sprog'!$A:$I,6,FALSE),IF(Selection!$B$4=\"DE\",VLOOKUP($A200,'Style navne sprog'!$A:$I,2,FALSE),IF(Selection!$B$4=\"GB\",VLOOKUP($A200,'Style navne sprog'!$A:$I,4,FALSE),IF(Selection!$B$4=\"SE\",VLOOKUP($A200,'Style navne sprog'!$A:$I,3,FALSE),IF(Selection!$B$4=\"NO\",VLOOKUP($A200,'Style navne sprog'!$A:$I,5,FALSE),IF(Selection!$B$4=\"PL\",VLOOKUP($A200,'Style navne sprog'!$A:$I,7,FALSE)))))))","v":"Durable socks"},6.6000000000000005,"","",""]
["1510",{"$f":"IF(Selection!$B$4=\"DK\",VLOOKUP($A201,'Style navne sprog'!$A:$I,6,FALSE),IF(Selection!$B$4=\"DE\",VLOOKUP($A201,'Style navne sprog'!$A:$I,2,FALSE),IF(Selection!$B$4=\"GB\",VLOOKUP($A201,'Style navne sprog'!$A:$I,4,FALSE),IF(Selection!$B$4=\"SE\",VLOOKUP($A201,'Style navne sprog'!$A:$I,3,FALSE),IF(Selection!$B$4=\"NO\",VLOOKUP($A201,'Style navne sprog'!$A:$I,5,FALSE),IF(Selection!$B$4=\"PL\",VLOOKUP($A201,'Style navne sprog'!$A:$I,7,FALSE)))))))","v":"Cotton bag"},6.65,"","",""]
["1800",{"$f":"IF(Selection!$B$4=\"DK\",VLOOKUP($A202,'Style navne sprog'!$A:$I,6,FALSE),IF(Selection!$B$4=\"DE\",VLOOKUP($A202,'Style navne sprog'!$A:$I,2,FALSE),IF(Selection!$B$4=\"GB\",VLOOKUP($A202,'Style navne sprog'!$A:$I,4,FALSE),IF(Selection!$B$4=\"SE\",VLOOKUP($A202,'Style navne sprog'!$A:$I,3,FALSE),IF(Selection!$B$4=\"NO\",VLOOKUP($A202,'Style navne sprog'!$A:$I,5,FALSE),IF(Selection!$B$4=\"PL\",VLOOKUP($A202,'Style navne sprog'!$A:$I,7,FALSE)))))))","v":"Sports bag"},28.25,"","",""]
["1802",{"$f":"IF(Selection!$B$4=\"DK\",VLOOKUP($A203,'Style navne sprog'!$A:$I,6,FALSE),IF(Selection!$B$4=\"DE\",VLOOKUP($A203,'Style navne sprog'!$A:$I,2,FALSE),IF(Selection!$B$4=\"GB\",VLOOKUP($A203,'Style navne sprog'!$A:$I,4,FALSE),IF(Selection!$B$4=\"SE\",VLOOKUP($A203,'Style navne sprog'!$A:$I,3,FALSE),IF(Selection!$B$4=\"NO\",VLOOKUP($A203,'Style navne sprog'!$A:$I,5,FALSE),IF(Selection!$B$4=\"PL\",VLOOKUP($A203,'Style navne sprog'!$A:$I,7,FALSE)))))))","v":"Large sports bag | trolley"},54.150000000000006,"","",""]
["1805",{"$f":"IF(Selection!$B$4=\"DK\",VLOOKUP($A204,'Style navne sprog'!$A:$I,6,FALSE),IF(Selection!$B$4=\"DE\",VLOOKUP($A204,'Style navne sprog'!$A:$I,2,FALSE),IF(Selection!$B$4=\"GB\",VLOOKUP($A204,'Style navne sprog'!$A:$I,4,FALSE),IF(Selection!$B$4=\"SE\",VLOOKUP($A204,'Style navne sprog'!$A:$I,3,FALSE),IF(Selection!$B$4=\"NO\",VLOOKUP($A204,'Style navne sprog'!$A:$I,5,FALSE),IF(Selection!$B$4=\"PL\",VLOOKUP($A204,'Style navne sprog'!$A:$I,7,FALSE)))))))","v":"Ripstop backpack"},28.200000000000003,"","",""]
["1810",{"$f":"IF(Selection!$B$4=\"DK\",VLOOKUP($A205,'Style navne sprog'!$A:$I,6,FALSE),IF(Selection!$B$4=\"DE\",VLOOKUP($A205,'Style navne sprog'!$A:$I,2,FALSE),IF(Selection!$B$4=\"GB\",VLOOKUP($A205,'Style navne sprog'!$A:$I,4,FALSE),IF(Selection!$B$4=\"SE\",VLOOKUP($A205,'Style navne sprog'!$A:$I,3,FALSE),IF(Selection!$B$4=\"NO\",VLOOKUP($A205,'Style navne sprog'!$A:$I,5,FALSE),IF(Selection!$B$4=\"PL\",VLOOKUP($A205,'Style navne sprog'!$A:$I,7,FALSE)))))))","v":"Backpack"},28.25,"","",""]
["1820",{"$f":"IF(Selection!$B$4=\"DK\",VLOOKUP($A206,'Style navne sprog'!$A:$I,6,FALSE),IF(Selection!$B$4=\"DE\",VLOOKUP($A206,'Style navne sprog'!$A:$I,2,FALSE),IF(Selection!$B$4=\"GB\",VLOOKUP($A206,'Style navne sprog'!$A:$I,4,FALSE),IF(Selection!$B$4=\"SE\",VLOOKUP($A206,'Style navne sprog'!$A:$I,3,FALSE),IF(Selection!$B$4=\"NO\",VLOOKUP($A206,'Style navne sprog'!$A:$I,5,FALSE),IF(Selection!$B$4=\"PL\",VLOOKUP($A206,'Style navne sprog'!$A:$I,7,FALSE)))))))","v":"Backpack | canvas"},44.150000000000006,"","",""]
["1821",{"$f":"IF(Selection!$B$4=\"DK\",VLOOKUP($A207,'Style navne sprog'!$A:$I,6,FALSE),IF(Selection!$B$4=\"DE\",VLOOKUP($A207,'Style navne sprog'!$A:$I,2,FALSE),IF(Selection!$B$4=\"GB\",VLOOKUP($A207,'Style navne sprog'!$A:$I,4,FALSE),IF(Selection!$B$4=\"SE\",VLOOKUP($A207,'Style navne sprog'!$A:$I,3,FALSE),IF(Selection!$B$4=\"NO\",VLOOKUP($A207,'Style navne sprog'!$A:$I,5,FALSE),IF(Selection!$B$4=\"PL\",VLOOKUP($A207,'Style navne sprog'!$A:$I,7,FALSE)))))))","v":"Shopping bag | canvas"},24.05,"","",""]
["1825",{"$f":"IF(Selection!$B$4=\"DK\",VLOOKUP($A208,'Style navne sprog'!$A:$I,6,FALSE),IF(Selection!$B$4=\"DE\",VLOOKUP($A208,'Style navne sprog'!$A:$I,2,FALSE),IF(Selection!$B$4=\"GB\",VLOOKUP($A208,'Style navne sprog'!$A:$I,4,FALSE),IF(Selection!$B$4=\"SE\",VLOOKUP($A208,'Style navne sprog'!$A:$I,3,FALSE),IF(Selection!$B$4=\"NO\",VLOOKUP($A208,'Style navne sprog'!$A:$I,5,FALSE),IF(Selection!$B$4=\"PL\",VLOOKUP($A208,'Style navne sprog'!$A:$I,7,FALSE)))))))","v":"Ripstop sports bag"},35.1,"","",""]
["1850",{"$f":"IF(Selection!$B$4=\"DK\",VLOOKUP($A209,'Style navne sprog'!$A:$I,6,FALSE),IF(Selection!$B$4=\"DE\",VLOOKUP($A209,'Style navne sprog'!$A:$I,2,FALSE),IF(Selection!$B$4=\"GB\",VLOOKUP($A209,'Style navne sprog'!$A:$I,4,FALSE),IF(Selection!$B$4=\"SE\",VLOOKUP($A209,'Style navne sprog'!$A:$I,3,FALSE),IF(Selection!$B$4=\"NO\",VLOOKUP($A209,'Style navne sprog'!$A:$I,5,FALSE),IF(Selection!$B$4=\"PL\",VLOOKUP($A209,'Style navne sprog'!$A:$I,7,FALSE)))))))","v":"Gym bag | backpack"},4.8500000000000005,"","",""]
["1864",{"$f":"IF(Selection!$B$4=\"DK\",VLOOKUP($A210,'Style navne sprog'!$A:$I,6,FALSE),IF(Selection!$B$4=\"DE\",VLOOKUP($A210,'Style navne sprog'!$A:$I,2,FALSE),IF(Selection!$B$4=\"GB\",VLOOKUP($A210,'Style navne sprog'!$A:$I,4,FALSE),IF(Selection!$B$4=\"SE\",VLOOKUP($A210,'Style navne sprog'!$A:$I,3,FALSE),IF(Selection!$B$4=\"NO\",VLOOKUP($A210,'Style navne sprog'!$A:$I,5,FALSE),IF(Selection!$B$4=\"PL\",VLOOKUP($A210,'Style navne sprog'!$A:$I,7,FALSE)))))))","v":"Computer bag"},48,"","",""]
["1880",{"$f":"IF(Selection!$B$4=\"DK\",VLOOKUP($A211,'Style navne sprog'!$A:$I,6,FALSE),IF(Selection!$B$4=\"DE\",VLOOKUP($A211,'Style navne sprog'!$A:$I,2,FALSE),IF(Selection!$B$4=\"GB\",VLOOKUP($A211,'Style navne sprog'!$A:$I,4,FALSE),IF(Selection!$B$4=\"SE\",VLOOKUP($A211,'Style navne sprog'!$A:$I,3,FALSE),IF(Selection!$B$4=\"NO\",VLOOKUP($A211,'Style navne sprog'!$A:$I,5,FALSE),IF(Selection!$B$4=\"PL\",VLOOKUP($A211,'Style navne sprog'!$A:$I,7,FALSE)))))))","v":"Shopping basket"},17.400000000000002,"","",""]
["1900",{"$f":"IF(Selection!$B$4=\"DK\",VLOOKUP($A212,'Style navne sprog'!$A:$I,6,FALSE),IF(Selection!$B$4=\"DE\",VLOOKUP($A212,'Style navne sprog'!$A:$I,2,FALSE),IF(Selection!$B$4=\"GB\",VLOOKUP($A212,'Style navne sprog'!$A:$I,4,FALSE),IF(Selection!$B$4=\"SE\",VLOOKUP($A212,'Style navne sprog'!$A:$I,3,FALSE),IF(Selection!$B$4=\"NO\",VLOOKUP($A212,'Style navne sprog'!$A:$I,5,FALSE),IF(Selection!$B$4=\"PL\",VLOOKUP($A212,'Style navne sprog'!$A:$I,7,FALSE)))))))","v":"Worker vest | EN 20471"},6.65,"","",""]
["1915",{"$f":"IF(Selection!$B$4=\"DK\",VLOOKUP($A213,'Style navne sprog'!$A:$I,6,FALSE),IF(Selection!$B$4=\"DE\",VLOOKUP($A213,'Style navne sprog'!$A:$I,2,FALSE),IF(Selection!$B$4=\"GB\",VLOOKUP($A213,'Style navne sprog'!$A:$I,4,FALSE),IF(Selection!$B$4=\"SE\",VLOOKUP($A213,'Style navne sprog'!$A:$I,3,FALSE),IF(Selection!$B$4=\"NO\",VLOOKUP($A213,'Style navne sprog'!$A:$I,5,FALSE),IF(Selection!$B$4=\"PL\",VLOOKUP($A213,'Style navne sprog'!$A:$I,7,FALSE)))))))","v":"Runner’s vest"},23.85,"","",""]
[null,null,"","",null,""]
["SPORT | GEYSER"]
["G11006",{"$f":"IF(Selection!$B$4=\"DK\",VLOOKUP($A216,'Style navne sprog'!$A:$I,6,FALSE),IF(Selection!$B$4=\"DE\",VLOOKUP($A216,'Style navne sprog'!$A:$I,2,FALSE),IF(Selection!$B$4=\"GB\",VLOOKUP($A216,'Style navne sprog'!$A:$I,4,FALSE),IF(Selection!$B$4=\"SE\",VLOOKUP($A216,'Style navne sprog'!$A:$I,3,FALSE),IF(Selection!$B$4=\"NO\",VLOOKUP($A216,'Style navne sprog'!$A:$I,5,FALSE),IF(Selection!$B$4=\"PL\",VLOOKUP($A216,'Style navne sprog'!$A:$I,7,FALSE)))))))","v":"GEYSER polo shirt | functional | women"},34.1,"","",""]
["G11020",{"$f":"IF(Selection!$B$4=\"DK\",VLOOKUP($A217,'Style navne sprog'!$A:$I,6,FALSE),IF(Selection!$B$4=\"DE\",VLOOKUP($A217,'Style navne sprog'!$A:$I,2,FALSE),IF(Selection!$B$4=\"GB\",VLOOKUP($A217,'Style navne sprog'!$A:$I,4,FALSE),IF(Selection!$B$4=\"SE\",VLOOKUP($A217,'Style navne sprog'!$A:$I,3,FALSE),IF(Selection!$B$4=\"NO\",VLOOKUP($A217,'Style navne sprog'!$A:$I,5,FALSE),IF(Selection!$B$4=\"PL\",VLOOKUP($A217,'Style navne sprog'!$A:$I,7,FALSE)))))))","v":"GEYSER T-shirt | seamless | women"},27.25,"","",""]
["G11021",{"$f":"IF(Selection!$B$4=\"DK\",VLOOKUP($A218,'Style navne sprog'!$A:$I,6,FALSE),IF(Selection!$B$4=\"DE\",VLOOKUP($A218,'Style navne sprog'!$A:$I,2,FALSE),IF(Selection!$B$4=\"GB\",VLOOKUP($A218,'Style navne sprog'!$A:$I,4,FALSE),IF(Selection!$B$4=\"SE\",VLOOKUP($A218,'Style navne sprog'!$A:$I,3,FALSE),IF(Selection!$B$4=\"NO\",VLOOKUP($A218,'Style navne sprog'!$A:$I,5,FALSE),IF(Selection!$B$4=\"PL\",VLOOKUP($A218,'Style navne sprog'!$A:$I,7,FALSE)))))))","v":"GEYSER long-sleeved T-shirt | seamless | women"},31.150000000000002,"","",""]
["G11024",{"$f":"IF(Selection!$B$4=\"DK\",VLOOKUP($A219,'Style navne sprog'!$A:$I,6,FALSE),IF(Selection!$B$4=\"DE\",VLOOKUP($A219,'Style navne sprog'!$A:$I,2,FALSE),IF(Selection!$B$4=\"GB\",VLOOKUP($A219,'Style navne sprog'!$A:$I,4,FALSE),IF(Selection!$B$4=\"SE\",VLOOKUP($A219,'Style navne sprog'!$A:$I,3,FALSE),IF(Selection!$B$4=\"NO\",VLOOKUP($A219,'Style navne sprog'!$A:$I,5,FALSE),IF(Selection!$B$4=\"PL\",VLOOKUP($A219,'Style navne sprog'!$A:$I,7,FALSE)))))))","v":"GEYSER striped T-shirt | seamless | women"},27.25,"","",""]
["G11032",{"$f":"IF(Selection!$B$4=\"DK\",VLOOKUP($A220,'Style navne sprog'!$A:$I,6,FALSE),IF(Selection!$B$4=\"DE\",VLOOKUP($A220,'Style navne sprog'!$A:$I,2,FALSE),IF(Selection!$B$4=\"GB\",VLOOKUP($A220,'Style navne sprog'!$A:$I,4,FALSE),IF(Selection!$B$4=\"SE\",VLOOKUP($A220,'Style navne sprog'!$A:$I,3,FALSE),IF(Selection!$B$4=\"NO\",VLOOKUP($A220,'Style navne sprog'!$A:$I,5,FALSE),IF(Selection!$B$4=\"PL\",VLOOKUP($A220,'Style navne sprog'!$A:$I,7,FALSE)))))))","v":"GEYSER hybrid jacket | women"},71.05,"","",""]
["G11033",{"$f":"IF(Selection!$B$4=\"DK\",VLOOKUP($A221,'Style navne sprog'!$A:$I,6,FALSE),IF(Selection!$B$4=\"DE\",VLOOKUP($A221,'Style navne sprog'!$A:$I,2,FALSE),IF(Selection!$B$4=\"GB\",VLOOKUP($A221,'Style navne sprog'!$A:$I,4,FALSE),IF(Selection!$B$4=\"SE\",VLOOKUP($A221,'Style navne sprog'!$A:$I,3,FALSE),IF(Selection!$B$4=\"NO\",VLOOKUP($A221,'Style navne sprog'!$A:$I,5,FALSE),IF(Selection!$B$4=\"PL\",VLOOKUP($A221,'Style navne sprog'!$A:$I,7,FALSE)))))))","v":"GEYSER hybrid vest | women"},57.650000000000006,"","",""]
["G11036",{"$f":"IF(Selection!$B$4=\"DK\",VLOOKUP($A222,'Style navne sprog'!$A:$I,6,FALSE),IF(Selection!$B$4=\"DE\",VLOOKUP($A222,'Style navne sprog'!$A:$I,2,FALSE),IF(Selection!$B$4=\"GB\",VLOOKUP($A222,'Style navne sprog'!$A:$I,4,FALSE),IF(Selection!$B$4=\"SE\",VLOOKUP($A222,'Style navne sprog'!$A:$I,3,FALSE),IF(Selection!$B$4=\"NO\",VLOOKUP($A222,'Style navne sprog'!$A:$I,5,FALSE),IF(Selection!$B$4=\"PL\",VLOOKUP($A222,'Style navne sprog'!$A:$I,7,FALSE)))))))","v":"GEYSER active pants | stretch | women"},47.7,"","",""]
["G11040",{"$f":"IF(Selection!$B$4=\"DK\",VLOOKUP($A223,'Style navne sprog'!$A:$I,6,FALSE),IF(Selection!$B$4=\"DE\",VLOOKUP($A223,'Style navne sprog'!$A:$I,2,FALSE),IF(Selection!$B$4=\"GB\",VLOOKUP($A223,'Style navne sprog'!$A:$I,4,FALSE),IF(Selection!$B$4=\"SE\",VLOOKUP($A223,'Style navne sprog'!$A:$I,3,FALSE),IF(Selection!$B$4=\"NO\",VLOOKUP($A223,'Style navne sprog'!$A:$I,5,FALSE),IF(Selection!$B$4=\"PL\",VLOOKUP($A223,'Style navne sprog'!$A:$I,7,FALSE)))))))","v":"GEYSER T-shirt | essential | women"},20,"","",""]
["G11048",{"$f":"IF(Selection!$B$4=\"DK\",VLOOKUP($A224,'Style navne sprog'!$A:$I,6,FALSE),IF(Selection!$B$4=\"DE\",VLOOKUP($A224,'Style navne sprog'!$A:$I,2,FALSE),IF(Selection!$B$4=\"GB\",VLOOKUP($A224,'Style navne sprog'!$A:$I,4,FALSE),IF(Selection!$B$4=\"SE\",VLOOKUP($A224,'Style navne sprog'!$A:$I,3,FALSE),IF(Selection!$B$4=\"NO\",VLOOKUP($A224,'Style navne sprog'!$A:$I,5,FALSE),IF(Selection!$B$4=\"PL\",VLOOKUP($A224,'Style navne sprog'!$A:$I,7,FALSE)))))))","v":"GEYSER performance tights | long | women"},40.550000000000004,"","",""]
["G11049",{"$f":"IF(Selection!$B$4=\"DK\",VLOOKUP($A225,'Style navne sprog'!$A:$I,6,FALSE),IF(Selection!$B$4=\"DE\",VLOOKUP($A225,'Style navne sprog'!$A:$I,2,FALSE),IF(Selection!$B$4=\"GB\",VLOOKUP($A225,'Style navne sprog'!$A:$I,4,FALSE),IF(Selection!$B$4=\"SE\",VLOOKUP($A225,'Style navne sprog'!$A:$I,3,FALSE),IF(Selection!$B$4=\"NO\",VLOOKUP($A225,'Style navne sprog'!$A:$I,5,FALSE),IF(Selection!$B$4=\"PL\",VLOOKUP($A225,'Style navne sprog'!$A:$I,7,FALSE)))))))","v":"GEYSER performance tights | short | women"},31.150000000000002,"","",""]
["G11070",{"$f":"IF(Selection!$B$4=\"DK\",VLOOKUP($A226,'Style navne sprog'!$A:$I,6,FALSE),IF(Selection!$B$4=\"DE\",VLOOKUP($A226,'Style navne sprog'!$A:$I,2,FALSE),IF(Selection!$B$4=\"GB\",VLOOKUP($A226,'Style navne sprog'!$A:$I,4,FALSE),IF(Selection!$B$4=\"SE\",VLOOKUP($A226,'Style navne sprog'!$A:$I,3,FALSE),IF(Selection!$B$4=\"NO\",VLOOKUP($A226,'Style navne sprog'!$A:$I,5,FALSE),IF(Selection!$B$4=\"PL\",VLOOKUP($A226,'Style navne sprog'!$A:$I,7,FALSE)))))))","v":"GEYSER winter jacket | women"},124.7,"","",""]
["G11080",{"$f":"IF(Selection!$B$4=\"DK\",VLOOKUP($A227,'Style navne sprog'!$A:$I,6,FALSE),IF(Selection!$B$4=\"DE\",VLOOKUP($A227,'Style navne sprog'!$A:$I,2,FALSE),IF(Selection!$B$4=\"GB\",VLOOKUP($A227,'Style navne sprog'!$A:$I,4,FALSE),IF(Selection!$B$4=\"SE\",VLOOKUP($A227,'Style navne sprog'!$A:$I,3,FALSE),IF(Selection!$B$4=\"NO\",VLOOKUP($A227,'Style navne sprog'!$A:$I,5,FALSE),IF(Selection!$B$4=\"PL\",VLOOKUP($A227,'Style navne sprog'!$A:$I,7,FALSE)))))))","v":"GEYSER stretch hoodie | women"},67.05,"","",""]
["G11090",{"$f":"IF(Selection!$B$4=\"DK\",VLOOKUP($A228,'Style navne sprog'!$A:$I,6,FALSE),IF(Selection!$B$4=\"DE\",VLOOKUP($A228,'Style navne sprog'!$A:$I,2,FALSE),IF(Selection!$B$4=\"GB\",VLOOKUP($A228,'Style navne sprog'!$A:$I,4,FALSE),IF(Selection!$B$4=\"SE\",VLOOKUP($A228,'Style navne sprog'!$A:$I,3,FALSE),IF(Selection!$B$4=\"NO\",VLOOKUP($A228,'Style navne sprog'!$A:$I,5,FALSE),IF(Selection!$B$4=\"PL\",VLOOKUP($A228,'Style navne sprog'!$A:$I,7,FALSE)))))))","v":"GEYSER stretch trainer | ¼ zip | women"},53.6,"","",""]
["G21006",{"$f":"IF(Selection!$B$4=\"DK\",VLOOKUP($A229,'Style navne sprog'!$A:$I,6,FALSE),IF(Selection!$B$4=\"DE\",VLOOKUP($A229,'Style navne sprog'!$A:$I,2,FALSE),IF(Selection!$B$4=\"GB\",VLOOKUP($A229,'Style navne sprog'!$A:$I,4,FALSE),IF(Selection!$B$4=\"SE\",VLOOKUP($A229,'Style navne sprog'!$A:$I,3,FALSE),IF(Selection!$B$4=\"NO\",VLOOKUP($A229,'Style navne sprog'!$A:$I,5,FALSE),IF(Selection!$B$4=\"PL\",VLOOKUP($A229,'Style navne sprog'!$A:$I,7,FALSE)))))))","v":"GEYSER polo shirt | functional"},34.1,"","",""]
["G21015",{"$f":"IF(Selection!$B$4=\"DK\",VLOOKUP($A230,'Style navne sprog'!$A:$I,6,FALSE),IF(Selection!$B$4=\"DE\",VLOOKUP($A230,'Style navne sprog'!$A:$I,2,FALSE),IF(Selection!$B$4=\"GB\",VLOOKUP($A230,'Style navne sprog'!$A:$I,4,FALSE),IF(Selection!$B$4=\"SE\",VLOOKUP($A230,'Style navne sprog'!$A:$I,3,FALSE),IF(Selection!$B$4=\"NO\",VLOOKUP($A230,'Style navne sprog'!$A:$I,5,FALSE),IF(Selection!$B$4=\"PL\",VLOOKUP($A230,'Style navne sprog'!$A:$I,7,FALSE)))))))","v":"GEYSER sporty training pants"},62.35,"","",""]
["G21020",{"$f":"IF(Selection!$B$4=\"DK\",VLOOKUP($A231,'Style navne sprog'!$A:$I,6,FALSE),IF(Selection!$B$4=\"DE\",VLOOKUP($A231,'Style navne sprog'!$A:$I,2,FALSE),IF(Selection!$B$4=\"GB\",VLOOKUP($A231,'Style navne sprog'!$A:$I,4,FALSE),IF(Selection!$B$4=\"SE\",VLOOKUP($A231,'Style navne sprog'!$A:$I,3,FALSE),IF(Selection!$B$4=\"NO\",VLOOKUP($A231,'Style navne sprog'!$A:$I,5,FALSE),IF(Selection!$B$4=\"PL\",VLOOKUP($A231,'Style navne sprog'!$A:$I,7,FALSE)))))))","v":"GEYSER T-shirt | seamless"},27.25,"","",""]
["G21021",{"$f":"IF(Selection!$B$4=\"DK\",VLOOKUP($A232,'Style navne sprog'!$A:$I,6,FALSE),IF(Selection!$B$4=\"DE\",VLOOKUP($A232,'Style navne sprog'!$A:$I,2,FALSE),IF(Selection!$B$4=\"GB\",VLOOKUP($A232,'Style navne sprog'!$A:$I,4,FALSE),IF(Selection!$B$4=\"SE\",VLOOKUP($A232,'Style navne sprog'!$A:$I,3,FALSE),IF(Selection!$B$4=\"NO\",VLOOKUP($A232,'Style navne sprog'!$A:$I,5,FALSE),IF(Selection!$B$4=\"PL\",VLOOKUP($A232,'Style navne sprog'!$A:$I,7,FALSE)))))))","v":"GEYSER long-sleeved T-shirt | seamless"},31.150000000000002,"","",""]
["G21024",{"$f":"IF(Selection!$B$4=\"DK\",VLOOKUP($A233,'Style navne sprog'!$A:$I,6,FALSE),IF(Selection!$B$4=\"DE\",VLOOKUP($A233,'Style navne sprog'!$A:$I,2,FALSE),IF(Selection!$B$4=\"GB\",VLOOKUP($A233,'Style navne sprog'!$A:$I,4,FALSE),IF(Selection!$B$4=\"SE\",VLOOKUP($A233,'Style navne sprog'!$A:$I,3,FALSE),IF(Selection!$B$4=\"NO\",VLOOKUP($A233,'Style navne sprog'!$A:$I,5,FALSE),IF(Selection!$B$4=\"PL\",VLOOKUP($A233,'Style navne sprog'!$A:$I,7,FALSE)))))))","v":"GEYSER striped T-shirt | seamless"},27.25,"","",""]
["G21032",{"$f":"IF(Selection!$B$4=\"DK\",VLOOKUP($A234,'Style navne sprog'!$A:$I,6,FALSE),IF(Selection!$B$4=\"DE\",VLOOKUP($A234,'Style navne sprog'!$A:$I,2,FALSE),IF(Selection!$B$4=\"GB\",VLOOKUP($A234,'Style navne sprog'!$A:$I,4,FALSE),IF(Selection!$B$4=\"SE\",VLOOKUP($A234,'Style navne sprog'!$A:$I,3,FALSE),IF(Selection!$B$4=\"NO\",VLOOKUP($A234,'Style navne sprog'!$A:$I,5,FALSE),IF(Selection!$B$4=\"PL\",VLOOKUP($A234,'Style navne sprog'!$A:$I,7,FALSE)))))))","v":"GEYSER hybrid jacket"},71.05,"","",""]
["G21033",{"$f":"IF(Selection!$B$4=\"DK\",VLOOKUP($A235,'Style navne sprog'!$A:$I,6,FALSE),IF(Selection!$B$4=\"DE\",VLOOKUP($A235,'Style navne sprog'!$A:$I,2,FALSE),IF(Selection!$B$4=\"GB\",VLOOKUP($A235,'Style navne sprog'!$A:$I,4,FALSE),IF(Selection!$B$4=\"SE\",VLOOKUP($A235,'Style navne sprog'!$A:$I,3,FALSE),IF(Selection!$B$4=\"NO\",VLOOKUP($A235,'Style navne sprog'!$A:$I,5,FALSE),IF(Selection!$B$4=\"PL\",VLOOKUP($A235,'Style navne sprog'!$A:$I,7,FALSE)))))))","v":"GEYSER hybrid vest"},57.650000000000006,"","",""]
["G21034",{"$f":"IF(Selection!$B$4=\"DK\",VLOOKUP($A236,'Style navne sprog'!$A:$I,6,FALSE),IF(Selection!$B$4=\"DE\",VLOOKUP($A236,'Style navne sprog'!$A:$I,2,FALSE),IF(Selection!$B$4=\"GB\",VLOOKUP($A236,'Style navne sprog'!$A:$I,4,FALSE),IF(Selection!$B$4=\"SE\",VLOOKUP($A236,'Style navne sprog'!$A:$I,3,FALSE),IF(Selection!$B$4=\"NO\",VLOOKUP($A236,'Style navne sprog'!$A:$I,5,FALSE),IF(Selection!$B$4=\"PL\",VLOOKUP($A236,'Style navne sprog'!$A:$I,7,FALSE)))))))","v":"GEYSER active shorts | stretch"},40.950000000000003,"","",""]
["G21036",{"$f":"IF(Selection!$B$4=\"DK\",VLOOKUP($A237,'Style navne sprog'!$A:$I,6,FALSE),IF(Selection!$B$4=\"DE\",VLOOKUP($A237,'Style navne sprog'!$A:$I,2,FALSE),IF(Selection!$B$4=\"GB\",VLOOKUP($A237,'Style navne sprog'!$A:$I,4,FALSE),IF(Selection!$B$4=\"SE\",VLOOKUP($A237,'Style navne sprog'!$A:$I,3,FALSE),IF(Selection!$B$4=\"NO\",VLOOKUP($A237,'Style navne sprog'!$A:$I,5,FALSE),IF(Selection!$B$4=\"PL\",VLOOKUP($A237,'Style navne sprog'!$A:$I,7,FALSE)))))))","v":"GEYSER active pants | stretch"},47.7,"","",""]
["G21040",{"$f":"IF(Selection!$B$4=\"DK\",VLOOKUP($A238,'Style navne sprog'!$A:$I,6,FALSE),IF(Selection!$B$4=\"DE\",VLOOKUP($A238,'Style navne sprog'!$A:$I,2,FALSE),IF(Selection!$B$4=\"GB\",VLOOKUP($A238,'Style navne sprog'!$A:$I,4,FALSE),IF(Selection!$B$4=\"SE\",VLOOKUP($A238,'Style navne sprog'!$A:$I,3,FALSE),IF(Selection!$B$4=\"NO\",VLOOKUP($A238,'Style navne sprog'!$A:$I,5,FALSE),IF(Selection!$B$4=\"PL\",VLOOKUP($A238,'Style navne sprog'!$A:$I,7,FALSE)))))))","v":"GEYSER T-shirt | essential"},20,"","",""]
["G21048",{"$f":"IF(Selection!$B$4=\"DK\",VLOOKUP($A239,'Style navne sprog'!$A:$I,6,FALSE),IF(Selection!$B$4=\"DE\",VLOOKUP($A239,'Style navne sprog'!$A:$I,2,FALSE),IF(Selection!$B$4=\"GB\",VLOOKUP($A239,'Style navne sprog'!$A:$I,4,FALSE),IF(Selection!$B$4=\"SE\",VLOOKUP($A239,'Style navne sprog'!$A:$I,3,FALSE),IF(Selection!$B$4=\"NO\",VLOOKUP($A239,'Style navne sprog'!$A:$I,5,FALSE),IF(Selection!$B$4=\"PL\",VLOOKUP($A239,'Style navne sprog'!$A:$I,7,FALSE)))))))","v":"GEYSER performance tights | long"},40.550000000000004,"","",""]
["G21049",{"$f":"IF(Selection!$B$4=\"DK\",VLOOKUP($A240,'Style navne sprog'!$A:$I,6,FALSE),IF(Selection!$B$4=\"DE\",VLOOKUP($A240,'Style navne sprog'!$A:$I,2,FALSE),IF(Selection!$B$4=\"GB\",VLOOKUP($A240,'Style navne sprog'!$A:$I,4,FALSE),IF(Selection!$B$4=\"SE\",VLOOKUP($A240,'Style navne sprog'!$A:$I,3,FALSE),IF(Selection!$B$4=\"NO\",VLOOKUP($A240,'Style navne sprog'!$A:$I,5,FALSE),IF(Selection!$B$4=\"PL\",VLOOKUP($A240,'Style navne sprog'!$A:$I,7,FALSE)))))))","v":"GEYSER performance tights | short"},31.150000000000002,"","",""]
["G21070",{"$f":"IF(Selection!$B$4=\"DK\",VLOOKUP($A241,'Style navne sprog'!$A:$I,6,FALSE),IF(Selection!$B$4=\"DE\",VLOOKUP($A241,'Style navne sprog'!$A:$I,2,FALSE),IF(Selection!$B$4=\"GB\",VLOOKUP($A241,'Style navne sprog'!$A:$I,4,FALSE),IF(Selection!$B$4=\"SE\",VLOOKUP($A241,'Style navne sprog'!$A:$I,3,FALSE),IF(Selection!$B$4=\"NO\",VLOOKUP($A241,'Style navne sprog'!$A:$I,5,FALSE),IF(Selection!$B$4=\"PL\",VLOOKUP($A241,'Style navne sprog'!$A:$I,7,FALSE)))))))","v":"GEYSER winter jacket"},124.7,"","",""]
["G21080",{"$f":"IF(Selection!$B$4=\"DK\",VLOOKUP($A242,'Style navne sprog'!$A:$I,6,FALSE),IF(Selection!$B$4=\"DE\",VLOOKUP($A242,'Style navne sprog'!$A:$I,2,FALSE),IF(Selection!$B$4=\"GB\",VLOOKUP($A242,'Style navne sprog'!$A:$I,4,FALSE),IF(Selection!$B$4=\"SE\",VLOOKUP($A242,'Style navne sprog'!$A:$I,3,FALSE),IF(Selection!$B$4=\"NO\",VLOOKUP($A242,'Style navne sprog'!$A:$I,5,FALSE),IF(Selection!$B$4=\"PL\",VLOOKUP($A242,'Style navne sprog'!$A:$I,7,FALSE)))))))","v":"GEYSER stretch hoodie"},67.05,"","",""]
["G21090",{"$f":"IF(Selection!$B$4=\"DK\",VLOOKUP($A243,'Style navne sprog'!$A:$I,6,FALSE),IF(Selection!$B$4=\"DE\",VLOOKUP($A243,'Style navne sprog'!$A:$I,2,FALSE),IF(Selection!$B$4=\"GB\",VLOOKUP($A243,'Style navne sprog'!$A:$I,4,FALSE),IF(Selection!$B$4=\"SE\",VLOOKUP($A243,'Style navne sprog'!$A:$I,3,FALSE),IF(Selection!$B$4=\"NO\",VLOOKUP($A243,'Style navne sprog'!$A:$I,5,FALSE),IF(Selection!$B$4=\"PL\",VLOOKUP($A243,'Style navne sprog'!$A:$I,7,FALSE)))))))","v":"GEYSER stretch trainer | ¼ zip"},53.6,"","",""]
["G50000",{"$f":"IF(Selection!$B$4=\"DK\",VLOOKUP($A244,'Style navne sprog'!$A:$I,6,FALSE),IF(Selection!$B$4=\"DE\",VLOOKUP($A244,'Style navne sprog'!$A:$I,2,FALSE),IF(Selection!$B$4=\"GB\",VLOOKUP($A244,'Style navne sprog'!$A:$I,4,FALSE),IF(Selection!$B$4=\"SE\",VLOOKUP($A244,'Style navne sprog'!$A:$I,3,FALSE),IF(Selection!$B$4=\"NO\",VLOOKUP($A244,'Style navne sprog'!$A:$I,5,FALSE),IF(Selection!$B$4=\"PL\",VLOOKUP($A244,'Style navne sprog'!$A:$I,7,FALSE)))))))","v":"GEYSER stretch running socks"},10.600000000000001,"","",""]
["G60010",{"$f":"IF(Selection!$B$4=\"DK\",VLOOKUP($A245,'Style navne sprog'!$A:$I,6,FALSE),IF(Selection!$B$4=\"DE\",VLOOKUP($A245,'Style navne sprog'!$A:$I,2,FALSE),IF(Selection!$B$4=\"GB\",VLOOKUP($A245,'Style navne sprog'!$A:$I,4,FALSE),IF(Selection!$B$4=\"SE\",VLOOKUP($A245,'Style navne sprog'!$A:$I,3,FALSE),IF(Selection!$B$4=\"NO\",VLOOKUP($A245,'Style navne sprog'!$A:$I,5,FALSE),IF(Selection!$B$4=\"PL\",VLOOKUP($A245,'Style navne sprog'!$A:$I,7,FALSE)))))))","v":"GEYSER backpack"},53.6,"","",""]
[]
["SEVEN SEAS - T-SHIRTS"]
["S620",{"$f":"IF(Selection!$B$4=\"DK\",VLOOKUP($A248,'Style navne sprog'!$A:$I,6,FALSE),IF(Selection!$B$4=\"DE\",VLOOKUP($A248,'Style navne sprog'!$A:$I,2,FALSE),IF(Selection!$B$4=\"GB\",VLOOKUP($A248,'Style navne sprog'!$A:$I,4,FALSE),IF(Selection!$B$4=\"SE\",VLOOKUP($A248,'Style navne sprog'!$A:$I,3,FALSE),IF(Selection!$B$4=\"NO\",VLOOKUP($A248,'Style navne sprog'!$A:$I,5,FALSE),IF(Selection!$B$4=\"PL\",VLOOKUP($A248,'Style navne sprog'!$A:$I,7,FALSE)))))))","v":"SEVEN SEAS T-shirt | o-neck"},16.850000000000001,"","3XL",1.4000000000000001]
["S630",{"$f":"IF(Selection!$B$4=\"DK\",VLOOKUP($A249,'Style navne sprog'!$A:$I,6,FALSE),IF(Selection!$B$4=\"DE\",VLOOKUP($A249,'Style navne sprog'!$A:$I,2,FALSE),IF(Selection!$B$4=\"GB\",VLOOKUP($A249,'Style navne sprog'!$A:$I,4,FALSE),IF(Selection!$B$4=\"SE\",VLOOKUP($A249,'Style navne sprog'!$A:$I,3,FALSE),IF(Selection!$B$4=\"NO\",VLOOKUP($A249,'Style navne sprog'!$A:$I,5,FALSE),IF(Selection!$B$4=\"PL\",VLOOKUP($A249,'Style navne sprog'!$A:$I,7,FALSE)))))))","v":"SEVEN SEAS T-shirt | o-neck | women"},16.850000000000001,"","3XL",1.4000000000000001]
[]
["SEVEN SEAS - POLOSHIRTS"]
["S600",{"$f":"IF(Selection!$B$4=\"DK\",VLOOKUP($A252,'Style navne sprog'!$A:$I,6,FALSE),IF(Selection!$B$4=\"DE\",VLOOKUP($A252,'Style navne sprog'!$A:$I,2,FALSE),IF(Selection!$B$4=\"GB\",VLOOKUP($A252,'Style navne sprog'!$A:$I,4,FALSE),IF(Selection!$B$4=\"SE\",VLOOKUP($A252,'Style navne sprog'!$A:$I,3,FALSE),IF(Selection!$B$4=\"NO\",VLOOKUP($A252,'Style navne sprog'!$A:$I,5,FALSE),IF(Selection!$B$4=\"PL\",VLOOKUP($A252,'Style navne sprog'!$A:$I,7,FALSE)))))))","v":"SEVEN SEAS The polo"},34.1,"","3XL",2.7]
["S610",{"$f":"IF(Selection!$B$4=\"DK\",VLOOKUP($A253,'Style navne sprog'!$A:$I,6,FALSE),IF(Selection!$B$4=\"DE\",VLOOKUP($A253,'Style navne sprog'!$A:$I,2,FALSE),IF(Selection!$B$4=\"GB\",VLOOKUP($A253,'Style navne sprog'!$A:$I,4,FALSE),IF(Selection!$B$4=\"SE\",VLOOKUP($A253,'Style navne sprog'!$A:$I,3,FALSE),IF(Selection!$B$4=\"NO\",VLOOKUP($A253,'Style navne sprog'!$A:$I,5,FALSE),IF(Selection!$B$4=\"PL\",VLOOKUP($A253,'Style navne sprog'!$A:$I,7,FALSE)))))))","v":"SEVEN SEAS The polo | women"},34.1,"","3XL",2.7]
[]
["SEVEN SEAS - KNIT"]
["S640",{"$f":"IF(Selection!$B$4=\"DK\",VLOOKUP($A256,'Style navne sprog'!$A:$I,6,FALSE),IF(Selection!$B$4=\"DE\",VLOOKUP($A256,'Style navne sprog'!$A:$I,2,FALSE),IF(Selection!$B$4=\"GB\",VLOOKUP($A256,'Style navne sprog'!$A:$I,4,FALSE),IF(Selection!$B$4=\"SE\",VLOOKUP($A256,'Style navne sprog'!$A:$I,3,FALSE),IF(Selection!$B$4=\"NO\",VLOOKUP($A256,'Style navne sprog'!$A:$I,5,FALSE),IF(Selection!$B$4=\"PL\",VLOOKUP($A256,'Style navne sprog'!$A:$I,7,FALSE)))))))","v":"SEVEN SEAS The knit | o-neck | women"},53.550000000000004,"","3XL",2.7]
["S650",{"$f":"IF(Selection!$B$4=\"DK\",VLOOKUP($A257,'Style navne sprog'!$A:$I,6,FALSE),IF(Selection!$B$4=\"DE\",VLOOKUP($A257,'Style navne sprog'!$A:$I,2,FALSE),IF(Selection!$B$4=\"GB\",VLOOKUP($A257,'Style navne sprog'!$A:$I,4,FALSE),IF(Selection!$B$4=\"SE\",VLOOKUP($A257,'Style navne sprog'!$A:$I,3,FALSE),IF(Selection!$B$4=\"NO\",VLOOKUP($A257,'Style navne sprog'!$A:$I,5,FALSE),IF(Selection!$B$4=\"PL\",VLOOKUP($A257,'Style navne sprog'!$A:$I,7,FALSE)))))))","v":"SEVEN SEAS The knit | o-neck"},53.550000000000004,"","3XL",2.7]
["S660",{"$f":"IF(Selection!$B$4=\"DK\",VLOOKUP($A258,'Style navne sprog'!$A:$I,6,FALSE),IF(Selection!$B$4=\"DE\",VLOOKUP($A258,'Style navne sprog'!$A:$I,2,FALSE),IF(Selection!$B$4=\"GB\",VLOOKUP($A258,'Style navne sprog'!$A:$I,4,FALSE),IF(Selection!$B$4=\"SE\",VLOOKUP($A258,'Style navne sprog'!$A:$I,3,FALSE),IF(Selection!$B$4=\"NO\",VLOOKUP($A258,'Style navne sprog'!$A:$I,5,FALSE),IF(Selection!$B$4=\"PL\",VLOOKUP($A258,'Style navne sprog'!$A:$I,7,FALSE)))))))","v":"SEVEN SEAS The cardigan"},67.850000000000009,"","3XL",2.7]
["S661",{"$f":"IF(Selection!$B$4=\"DK\",VLOOKUP($A259,'Style navne sprog'!$A:$I,6,FALSE),IF(Selection!$B$4=\"DE\",VLOOKUP($A259,'Style navne sprog'!$A:$I,2,FALSE),IF(Selection!$B$4=\"GB\",VLOOKUP($A259,'Style navne sprog'!$A:$I,4,FALSE),IF(Selection!$B$4=\"SE\",VLOOKUP($A259,'Style navne sprog'!$A:$I,3,FALSE),IF(Selection!$B$4=\"NO\",VLOOKUP($A259,'Style navne sprog'!$A:$I,5,FALSE),IF(Selection!$B$4=\"PL\",VLOOKUP($A259,'Style navne sprog'!$A:$I,7,FALSE)))))))","v":"SEVEN SEAS The cardigan | women"},67.850000000000009,"","3XL",2.7]
["S670",{"$f":"IF(Selection!$B$4=\"DK\",VLOOKUP($A260,'Style navne sprog'!$A:$I,6,FALSE),IF(Selection!$B$4=\"DE\",VLOOKUP($A260,'Style navne sprog'!$A:$I,2,FALSE),IF(Selection!$B$4=\"GB\",VLOOKUP($A260,'Style navne sprog'!$A:$I,4,FALSE),IF(Selection!$B$4=\"SE\",VLOOKUP($A260,'Style navne sprog'!$A:$I,3,FALSE),IF(Selection!$B$4=\"NO\",VLOOKUP($A260,'Style navne sprog'!$A:$I,5,FALSE),IF(Selection!$B$4=\"PL\",VLOOKUP($A260,'Style navne sprog'!$A:$I,7,FALSE)))))))","v":"SEVEN SEAS The knit | v-neck"},53.550000000000004,"","3XL",2.7]
["S671",{"$f":"IF(Selection!$B$4=\"DK\",VLOOKUP($A261,'Style navne sprog'!$A:$I,6,FALSE),IF(Selection!$B$4=\"DE\",VLOOKUP($A261,'Style navne sprog'!$A:$I,2,FALSE),IF(Selection!$B$4=\"GB\",VLOOKUP($A261,'Style navne sprog'!$A:$I,4,FALSE),IF(Selection!$B$4=\"SE\",VLOOKUP($A261,'Style navne sprog'!$A:$I,3,FALSE),IF(Selection!$B$4=\"NO\",VLOOKUP($A261,'Style navne sprog'!$A:$I,5,FALSE),IF(Selection!$B$4=\"PL\",VLOOKUP($A261,'Style navne sprog'!$A:$I,7,FALSE)))))))","v":"SEVEN SEAS The knit | v-neck | women"},53.550000000000004,"","3XL",2.7]
[]
["SEVEN SEAS - SHIRTS"]
["S370",{"$f":"IF(Selection!$B$4=\"DK\",VLOOKUP($A264,'Style navne sprog'!$A:$I,6,FALSE),IF(Selection!$B$4=\"DE\",VLOOKUP($A264,'Style navne sprog'!$A:$I,2,FALSE),IF(Selection!$B$4=\"GB\",VLOOKUP($A264,'Style navne sprog'!$A:$I,4,FALSE),IF(Selection!$B$4=\"SE\",VLOOKUP($A264,'Style navne sprog'!$A:$I,3,FALSE),IF(Selection!$B$4=\"NO\",VLOOKUP($A264,'Style navne sprog'!$A:$I,5,FALSE),IF(Selection!$B$4=\"PL\",VLOOKUP($A264,'Style navne sprog'!$A:$I,7,FALSE)))))))","v":"SEVEN SEAS Fine Twill Contrast | modern"},53.550000000000004,"","3XL-5XL",2.7]
["S371",{"$f":"IF(Selection!$B$4=\"DK\",VLOOKUP($A265,'Style navne sprog'!$A:$I,6,FALSE),IF(Selection!$B$4=\"DE\",VLOOKUP($A265,'Style navne sprog'!$A:$I,2,FALSE),IF(Selection!$B$4=\"GB\",VLOOKUP($A265,'Style navne sprog'!$A:$I,4,FALSE),IF(Selection!$B$4=\"SE\",VLOOKUP($A265,'Style navne sprog'!$A:$I,3,FALSE),IF(Selection!$B$4=\"NO\",VLOOKUP($A265,'Style navne sprog'!$A:$I,5,FALSE),IF(Selection!$B$4=\"PL\",VLOOKUP($A265,'Style navne sprog'!$A:$I,7,FALSE)))))))","v":"SEVEN SEAS Fine Twill Contrast | slim"},53.550000000000004,"","3XL-4XL",""]
["S372",{"$f":"IF(Selection!$B$4=\"DK\",VLOOKUP($A266,'Style navne sprog'!$A:$I,6,FALSE),IF(Selection!$B$4=\"DE\",VLOOKUP($A266,'Style navne sprog'!$A:$I,2,FALSE),IF(Selection!$B$4=\"GB\",VLOOKUP($A266,'Style navne sprog'!$A:$I,4,FALSE),IF(Selection!$B$4=\"SE\",VLOOKUP($A266,'Style navne sprog'!$A:$I,3,FALSE),IF(Selection!$B$4=\"NO\",VLOOKUP($A266,'Style navne sprog'!$A:$I,5,FALSE),IF(Selection!$B$4=\"PL\",VLOOKUP($A266,'Style navne sprog'!$A:$I,7,FALSE)))))))","v":"SEVEN SEAS Fine Twill Contrast | modern | women"},53.550000000000004,"","3XL-4XL",2.7]
["S50",{"$f":"IF(Selection!$B$4=\"DK\",VLOOKUP($A267,'Style navne sprog'!$A:$I,6,FALSE),IF(Selection!$B$4=\"DE\",VLOOKUP($A267,'Style navne sprog'!$A:$I,2,FALSE),IF(Selection!$B$4=\"GB\",VLOOKUP($A267,'Style navne sprog'!$A:$I,4,FALSE),IF(Selection!$B$4=\"SE\",VLOOKUP($A267,'Style navne sprog'!$A:$I,3,FALSE),IF(Selection!$B$4=\"NO\",VLOOKUP($A267,'Style navne sprog'!$A:$I,5,FALSE),IF(Selection!$B$4=\"PL\",VLOOKUP($A267,'Style navne sprog'!$A:$I,7,FALSE)))))))","v":"SEVEN SEAS Hybrid shirt | modern"},67,"","3XL-4XL",2.7]
["S51",{"$f":"IF(Selection!$B$4=\"DK\",VLOOKUP($A268,'Style navne sprog'!$A:$I,6,FALSE),IF(Selection!$B$4=\"DE\",VLOOKUP($A268,'Style navne sprog'!$A:$I,2,FALSE),IF(Selection!$B$4=\"GB\",VLOOKUP($A268,'Style navne sprog'!$A:$I,4,FALSE),IF(Selection!$B$4=\"SE\",VLOOKUP($A268,'Style navne sprog'!$A:$I,3,FALSE),IF(Selection!$B$4=\"NO\",VLOOKUP($A268,'Style navne sprog'!$A:$I,5,FALSE),IF(Selection!$B$4=\"PL\",VLOOKUP($A268,'Style navne sprog'!$A:$I,7,FALSE)))))))","v":"SEVEN SEAS Hybrid shirt | slim"},67,"",""]
["S52",{"$f":"IF(Selection!$B$4=\"DK\",VLOOKUP($A269,'Style navne sprog'!$A:$I,6,FALSE),IF(Selection!$B$4=\"DE\",VLOOKUP($A269,'Style navne sprog'!$A:$I,2,FALSE),IF(Selection!$B$4=\"GB\",VLOOKUP($A269,'Style navne sprog'!$A:$I,4,FALSE),IF(Selection!$B$4=\"SE\",VLOOKUP($A269,'Style navne sprog'!$A:$I,3,FALSE),IF(Selection!$B$4=\"NO\",VLOOKUP($A269,'Style navne sprog'!$A:$I,5,FALSE),IF(Selection!$B$4=\"PL\",VLOOKUP($A269,'Style navne sprog'!$A:$I,7,FALSE)))))))","v":"SEVEN SEAS Hybrid shirt | modern | women"},67,"","3XL-4XL",2.7]
["S60",{"$f":"IF(Selection!$B$4=\"DK\",VLOOKUP($A270,'Style navne sprog'!$A:$I,6,FALSE),IF(Selection!$B$4=\"DE\",VLOOKUP($A270,'Style navne sprog'!$A:$I,2,FALSE),IF(Selection!$B$4=\"GB\",VLOOKUP($A270,'Style navne sprog'!$A:$I,4,FALSE),IF(Selection!$B$4=\"SE\",VLOOKUP($A270,'Style navne sprog'!$A:$I,3,FALSE),IF(Selection!$B$4=\"NO\",VLOOKUP($A270,'Style navne sprog'!$A:$I,5,FALSE),IF(Selection!$B$4=\"PL\",VLOOKUP($A270,'Style navne sprog'!$A:$I,7,FALSE)))))))","v":"SEVEN SEAS Oxford | modern"},53.550000000000004,"","3XL-5XL",2.7]
["S61",{"$f":"IF(Selection!$B$4=\"DK\",VLOOKUP($A271,'Style navne sprog'!$A:$I,6,FALSE),IF(Selection!$B$4=\"DE\",VLOOKUP($A271,'Style navne sprog'!$A:$I,2,FALSE),IF(Selection!$B$4=\"GB\",VLOOKUP($A271,'Style navne sprog'!$A:$I,4,FALSE),IF(Selection!$B$4=\"SE\",VLOOKUP($A271,'Style navne sprog'!$A:$I,3,FALSE),IF(Selection!$B$4=\"NO\",VLOOKUP($A271,'Style navne sprog'!$A:$I,5,FALSE),IF(Selection!$B$4=\"PL\",VLOOKUP($A271,'Style navne sprog'!$A:$I,7,FALSE)))))))","v":"SEVEN SEAS Oxford | slim"},53.550000000000004,"","3XL",2.7]
["S62",{"$f":"IF(Selection!$B$4=\"DK\",VLOOKUP($A272,'Style navne sprog'!$A:$I,6,FALSE),IF(Selection!$B$4=\"DE\",VLOOKUP($A272,'Style navne sprog'!$A:$I,2,FALSE),IF(Selection!$B$4=\"GB\",VLOOKUP($A272,'Style navne sprog'!$A:$I,4,FALSE),IF(Selection!$B$4=\"SE\",VLOOKUP($A272,'Style navne sprog'!$A:$I,3,FALSE),IF(Selection!$B$4=\"NO\",VLOOKUP($A272,'Style navne sprog'!$A:$I,5,FALSE),IF(Selection!$B$4=\"PL\",VLOOKUP($A272,'Style navne sprog'!$A:$I,7,FALSE)))))))","v":"SEVEN SEAS Oxford | modern | women"},53.550000000000004,"","3XL-4XL",2.7]
["S63",{"$f":"IF(Selection!$B$4=\"DK\",VLOOKUP($A273,'Style navne sprog'!$A:$I,6,FALSE),IF(Selection!$B$4=\"DE\",VLOOKUP($A273,'Style navne sprog'!$A:$I,2,FALSE),IF(Selection!$B$4=\"GB\",VLOOKUP($A273,'Style navne sprog'!$A:$I,4,FALSE),IF(Selection!$B$4=\"SE\",VLOOKUP($A273,'Style navne sprog'!$A:$I,3,FALSE),IF(Selection!$B$4=\"NO\",VLOOKUP($A273,'Style navne sprog'!$A:$I,5,FALSE),IF(Selection!$B$4=\"PL\",VLOOKUP($A273,'Style navne sprog'!$A:$I,7,FALSE)))))))","v":"SEVEN SEAS Oxford | long | modern | women"},53.550000000000004,"","3XL-4XL",2.7]
["S70",{"$f":"IF(Selection!$B$4=\"DK\",VLOOKUP($A274,'Style navne sprog'!$A:$I,6,FALSE),IF(Selection!$B$4=\"DE\",VLOOKUP($A274,'Style navne sprog'!$A:$I,2,FALSE),IF(Selection!$B$4=\"GB\",VLOOKUP($A274,'Style navne sprog'!$A:$I,4,FALSE),IF(Selection!$B$4=\"SE\",VLOOKUP($A274,'Style navne sprog'!$A:$I,3,FALSE),IF(Selection!$B$4=\"NO\",VLOOKUP($A274,'Style navne sprog'!$A:$I,5,FALSE),IF(Selection!$B$4=\"PL\",VLOOKUP($A274,'Style navne sprog'!$A:$I,7,FALSE)))))))","v":"SEVEN SEAS Fine Twill Cadet | modern"},53.550000000000004,"","3XL-5XL",2.7]
["S721",{"$f":"IF(Selection!$B$4=\"DK\",VLOOKUP($A275,'Style navne sprog'!$A:$I,6,FALSE),IF(Selection!$B$4=\"DE\",VLOOKUP($A275,'Style navne sprog'!$A:$I,2,FALSE),IF(Selection!$B$4=\"GB\",VLOOKUP($A275,'Style navne sprog'!$A:$I,4,FALSE),IF(Selection!$B$4=\"SE\",VLOOKUP($A275,'Style navne sprog'!$A:$I,3,FALSE),IF(Selection!$B$4=\"NO\",VLOOKUP($A275,'Style navne sprog'!$A:$I,5,FALSE),IF(Selection!$B$4=\"PL\",VLOOKUP($A275,'Style navne sprog'!$A:$I,7,FALSE)))))))","v":"SEVEN SEAS Fine Twill | modern | s/s | women"},53.550000000000004,"","3XL-4XL",2.7]
["S780",{"$f":"IF(Selection!$B$4=\"DK\",VLOOKUP($A276,'Style navne sprog'!$A:$I,6,FALSE),IF(Selection!$B$4=\"DE\",VLOOKUP($A276,'Style navne sprog'!$A:$I,2,FALSE),IF(Selection!$B$4=\"GB\",VLOOKUP($A276,'Style navne sprog'!$A:$I,4,FALSE),IF(Selection!$B$4=\"SE\",VLOOKUP($A276,'Style navne sprog'!$A:$I,3,FALSE),IF(Selection!$B$4=\"NO\",VLOOKUP($A276,'Style navne sprog'!$A:$I,5,FALSE),IF(Selection!$B$4=\"PL\",VLOOKUP($A276,'Style navne sprog'!$A:$I,7,FALSE)))))))","v":"SEVEN SEAS Fine Twill Cadet | modern | women"},53.550000000000004,"","3XL-4XL",2.7]
["S84",{"$f":"IF(Selection!$B$4=\"DK\",VLOOKUP($A277,'Style navne sprog'!$A:$I,6,FALSE),IF(Selection!$B$4=\"DE\",VLOOKUP($A277,'Style navne sprog'!$A:$I,2,FALSE),IF(Selection!$B$4=\"GB\",VLOOKUP($A277,'Style navne sprog'!$A:$I,4,FALSE),IF(Selection!$B$4=\"SE\",VLOOKUP($A277,'Style navne sprog'!$A:$I,3,FALSE),IF(Selection!$B$4=\"NO\",VLOOKUP($A277,'Style navne sprog'!$A:$I,5,FALSE),IF(Selection!$B$4=\"PL\",VLOOKUP($A277,'Style navne sprog'!$A:$I,7,FALSE)))))))","v":"SEVEN SEAS The Jersey | modern"},53.550000000000004,"","3XL-4XL",2.7]
["S85",{"$f":"IF(Selection!$B$4=\"DK\",VLOOKUP($A278,'Style navne sprog'!$A:$I,6,FALSE),IF(Selection!$B$4=\"DE\",VLOOKUP($A278,'Style navne sprog'!$A:$I,2,FALSE),IF(Selection!$B$4=\"GB\",VLOOKUP($A278,'Style navne sprog'!$A:$I,4,FALSE),IF(Selection!$B$4=\"SE\",VLOOKUP($A278,'Style navne sprog'!$A:$I,3,FALSE),IF(Selection!$B$4=\"NO\",VLOOKUP($A278,'Style navne sprog'!$A:$I,5,FALSE),IF(Selection!$B$4=\"PL\",VLOOKUP($A278,'Style navne sprog'!$A:$I,7,FALSE)))))))","v":"SEVEN SEAS The Jersey | modern | women"},53.550000000000004,"","3XL-4XL",2.7]
["S86",{"$f":"IF(Selection!$B$4=\"DK\",VLOOKUP($A279,'Style navne sprog'!$A:$I,6,FALSE),IF(Selection!$B$4=\"DE\",VLOOKUP($A279,'Style navne sprog'!$A:$I,2,FALSE),IF(Selection!$B$4=\"GB\",VLOOKUP($A279,'Style navne sprog'!$A:$I,4,FALSE),IF(Selection!$B$4=\"SE\",VLOOKUP($A279,'Style navne sprog'!$A:$I,3,FALSE),IF(Selection!$B$4=\"NO\",VLOOKUP($A279,'Style navne sprog'!$A:$I,5,FALSE),IF(Selection!$B$4=\"PL\",VLOOKUP($A279,'Style navne sprog'!$A:$I,7,FALSE)))))))","v":"SEVEN SEAS The Jersey | slim"},53.550000000000004,"","3XL-4XL",2.7]
["S90",{"$f":"IF(Selection!$B$4=\"DK\",VLOOKUP($A280,'Style navne sprog'!$A:$I,6,FALSE),IF(Selection!$B$4=\"DE\",VLOOKUP($A280,'Style navne sprog'!$A:$I,2,FALSE),IF(Selection!$B$4=\"GB\",VLOOKUP($A280,'Style navne sprog'!$A:$I,4,FALSE),IF(Selection!$B$4=\"SE\",VLOOKUP($A280,'Style navne sprog'!$A:$I,3,FALSE),IF(Selection!$B$4=\"NO\",VLOOKUP($A280,'Style navne sprog'!$A:$I,5,FALSE),IF(Selection!$B$4=\"PL\",VLOOKUP($A280,'Style navne sprog'!$A:$I,7,FALSE)))))))","v":"SEVEN SEAS Fine Twill Cadet | slim"},53.550000000000004,"","",""]
["SS20",{"$f":"IF(Selection!$B$4=\"DK\",VLOOKUP($A281,'Style navne sprog'!$A:$I,6,FALSE),IF(Selection!$B$4=\"DE\",VLOOKUP($A281,'Style navne sprog'!$A:$I,2,FALSE),IF(Selection!$B$4=\"GB\",VLOOKUP($A281,'Style navne sprog'!$A:$I,4,FALSE),IF(Selection!$B$4=\"SE\",VLOOKUP($A281,'Style navne sprog'!$A:$I,3,FALSE),IF(Selection!$B$4=\"NO\",VLOOKUP($A281,'Style navne sprog'!$A:$I,5,FALSE),IF(Selection!$B$4=\"PL\",VLOOKUP($A281,'Style navne sprog'!$A:$I,7,FALSE)))))))","v":"SEVEN SEAS Fine Twill California | modern"},53.550000000000004,"","3XL-5XL",2.7]
["SS254",{"$f":"IF(Selection!$B$4=\"DK\",VLOOKUP($A282,'Style navne sprog'!$A:$I,6,FALSE),IF(Selection!$B$4=\"DE\",VLOOKUP($A282,'Style navne sprog'!$A:$I,2,FALSE),IF(Selection!$B$4=\"GB\",VLOOKUP($A282,'Style navne sprog'!$A:$I,4,FALSE),IF(Selection!$B$4=\"SE\",VLOOKUP($A282,'Style navne sprog'!$A:$I,3,FALSE),IF(Selection!$B$4=\"NO\",VLOOKUP($A282,'Style navne sprog'!$A:$I,5,FALSE),IF(Selection!$B$4=\"PL\",VLOOKUP($A282,'Style navne sprog'!$A:$I,7,FALSE)))))))","v":"SEVEN SEAS Fine Twill | modern | s/s"},53.550000000000004,"","3XL-5XL",2.7]
["SS30",{"$f":"IF(Selection!$B$4=\"DK\",VLOOKUP($A283,'Style navne sprog'!$A:$I,6,FALSE),IF(Selection!$B$4=\"DE\",VLOOKUP($A283,'Style navne sprog'!$A:$I,2,FALSE),IF(Selection!$B$4=\"GB\",VLOOKUP($A283,'Style navne sprog'!$A:$I,4,FALSE),IF(Selection!$B$4=\"SE\",VLOOKUP($A283,'Style navne sprog'!$A:$I,3,FALSE),IF(Selection!$B$4=\"NO\",VLOOKUP($A283,'Style navne sprog'!$A:$I,5,FALSE),IF(Selection!$B$4=\"PL\",VLOOKUP($A283,'Style navne sprog'!$A:$I,7,FALSE)))))))","v":"SEVEN SEAS Fine Twill | slim"},53.550000000000004,"","",""]
["SS310",{"$f":"IF(Selection!$B$4=\"DK\",VLOOKUP($A284,'Style navne sprog'!$A:$I,6,FALSE),IF(Selection!$B$4=\"DE\",VLOOKUP($A284,'Style navne sprog'!$A:$I,2,FALSE),IF(Selection!$B$4=\"GB\",VLOOKUP($A284,'Style navne sprog'!$A:$I,4,FALSE),IF(Selection!$B$4=\"SE\",VLOOKUP($A284,'Style navne sprog'!$A:$I,3,FALSE),IF(Selection!$B$4=\"NO\",VLOOKUP($A284,'Style navne sprog'!$A:$I,5,FALSE),IF(Selection!$B$4=\"PL\",VLOOKUP($A284,'Style navne sprog'!$A:$I,7,FALSE)))))))","v":"SEVEN SEAS Royal Oxford | modern"},53.550000000000004,"","3XL-5XL",2.7]
["SS311",{"$f":"IF(Selection!$B$4=\"DK\",VLOOKUP($A285,'Style navne sprog'!$A:$I,6,FALSE),IF(Selection!$B$4=\"DE\",VLOOKUP($A285,'Style navne sprog'!$A:$I,2,FALSE),IF(Selection!$B$4=\"GB\",VLOOKUP($A285,'Style navne sprog'!$A:$I,4,FALSE),IF(Selection!$B$4=\"SE\",VLOOKUP($A285,'Style navne sprog'!$A:$I,3,FALSE),IF(Selection!$B$4=\"NO\",VLOOKUP($A285,'Style navne sprog'!$A:$I,5,FALSE),IF(Selection!$B$4=\"PL\",VLOOKUP($A285,'Style navne sprog'!$A:$I,7,FALSE)))))))","v":"SEVEN SEAS Royal Oxford | slim"},53.550000000000004,"","",""]
["SS37",{"$f":"IF(Selection!$B$4=\"DK\",VLOOKUP($A286,'Style navne sprog'!$A:$I,6,FALSE),IF(Selection!$B$4=\"DE\",VLOOKUP($A286,'Style navne sprog'!$A:$I,2,FALSE),IF(Selection!$B$4=\"GB\",VLOOKUP($A286,'Style navne sprog'!$A:$I,4,FALSE),IF(Selection!$B$4=\"SE\",VLOOKUP($A286,'Style navne sprog'!$A:$I,3,FALSE),IF(Selection!$B$4=\"NO\",VLOOKUP($A286,'Style navne sprog'!$A:$I,5,FALSE),IF(Selection!$B$4=\"PL\",VLOOKUP($A286,'Style navne sprog'!$A:$I,7,FALSE)))))))","v":"SEVEN SEAS Fine Twill California | slim"},53.550000000000004,"","",""]
["SS402",{"$f":"IF(Selection!$B$4=\"DK\",VLOOKUP($A287,'Style navne sprog'!$A:$I,6,FALSE),IF(Selection!$B$4=\"DE\",VLOOKUP($A287,'Style navne sprog'!$A:$I,2,FALSE),IF(Selection!$B$4=\"GB\",VLOOKUP($A287,'Style navne sprog'!$A:$I,4,FALSE),IF(Selection!$B$4=\"SE\",VLOOKUP($A287,'Style navne sprog'!$A:$I,3,FALSE),IF(Selection!$B$4=\"NO\",VLOOKUP($A287,'Style navne sprog'!$A:$I,5,FALSE),IF(Selection!$B$4=\"PL\",VLOOKUP($A287,'Style navne sprog'!$A:$I,7,FALSE)))))))","v":"SEVEN SEAS Poplin | slim"},53.550000000000004,"","",""]
["SS410",{"$f":"IF(Selection!$B$4=\"DK\",VLOOKUP($A288,'Style navne sprog'!$A:$I,6,FALSE),IF(Selection!$B$4=\"DE\",VLOOKUP($A288,'Style navne sprog'!$A:$I,2,FALSE),IF(Selection!$B$4=\"GB\",VLOOKUP($A288,'Style navne sprog'!$A:$I,4,FALSE),IF(Selection!$B$4=\"SE\",VLOOKUP($A288,'Style navne sprog'!$A:$I,3,FALSE),IF(Selection!$B$4=\"NO\",VLOOKUP($A288,'Style navne sprog'!$A:$I,5,FALSE),IF(Selection!$B$4=\"PL\",VLOOKUP($A288,'Style navne sprog'!$A:$I,7,FALSE)))))))","v":"SEVEN SEAS Poplin | modern | s/s"},53.550000000000004,"","3XL-5XL",2.7]
["SS500",{"$f":"IF(Selection!$B$4=\"DK\",VLOOKUP($A289,'Style navne sprog'!$A:$I,6,FALSE),IF(Selection!$B$4=\"DE\",VLOOKUP($A289,'Style navne sprog'!$A:$I,2,FALSE),IF(Selection!$B$4=\"GB\",VLOOKUP($A289,'Style navne sprog'!$A:$I,4,FALSE),IF(Selection!$B$4=\"SE\",VLOOKUP($A289,'Style navne sprog'!$A:$I,3,FALSE),IF(Selection!$B$4=\"NO\",VLOOKUP($A289,'Style navne sprog'!$A:$I,5,FALSE),IF(Selection!$B$4=\"PL\",VLOOKUP($A289,'Style navne sprog'!$A:$I,7,FALSE)))))))","v":"SEVEN SEAS Soft Denim | modern"},53.550000000000004,"","3XL-5XL",2.7]
["SS7",{"$f":"IF(Selection!$B$4=\"DK\",VLOOKUP($A290,'Style navne sprog'!$A:$I,6,FALSE),IF(Selection!$B$4=\"DE\",VLOOKUP($A290,'Style navne sprog'!$A:$I,2,FALSE),IF(Selection!$B$4=\"GB\",VLOOKUP($A290,'Style navne sprog'!$A:$I,4,FALSE),IF(Selection!$B$4=\"SE\",VLOOKUP($A290,'Style navne sprog'!$A:$I,3,FALSE),IF(Selection!$B$4=\"NO\",VLOOKUP($A290,'Style navne sprog'!$A:$I,5,FALSE),IF(Selection!$B$4=\"PL\",VLOOKUP($A290,'Style navne sprog'!$A:$I,7,FALSE)))))))","v":"SEVEN SEAS Poplin | modern"},53.550000000000004,"","3XL-5XL",2.7]
["SS710",{"$f":"IF(Selection!$B$4=\"DK\",VLOOKUP($A291,'Style navne sprog'!$A:$I,6,FALSE),IF(Selection!$B$4=\"DE\",VLOOKUP($A291,'Style navne sprog'!$A:$I,2,FALSE),IF(Selection!$B$4=\"GB\",VLOOKUP($A291,'Style navne sprog'!$A:$I,4,FALSE),IF(Selection!$B$4=\"SE\",VLOOKUP($A291,'Style navne sprog'!$A:$I,3,FALSE),IF(Selection!$B$4=\"NO\",VLOOKUP($A291,'Style navne sprog'!$A:$I,5,FALSE),IF(Selection!$B$4=\"PL\",VLOOKUP($A291,'Style navne sprog'!$A:$I,7,FALSE)))))))","v":"SEVEN SEAS Poplin | modern | women"},53.550000000000004,"","3XL-4XL",2.7]
["SS720",{"$f":"IF(Selection!$B$4=\"DK\",VLOOKUP($A292,'Style navne sprog'!$A:$I,6,FALSE),IF(Selection!$B$4=\"DE\",VLOOKUP($A292,'Style navne sprog'!$A:$I,2,FALSE),IF(Selection!$B$4=\"GB\",VLOOKUP($A292,'Style navne sprog'!$A:$I,4,FALSE),IF(Selection!$B$4=\"SE\",VLOOKUP($A292,'Style navne sprog'!$A:$I,3,FALSE),IF(Selection!$B$4=\"NO\",VLOOKUP($A292,'Style navne sprog'!$A:$I,5,FALSE),IF(Selection!$B$4=\"PL\",VLOOKUP($A292,'Style navne sprog'!$A:$I,7,FALSE)))))))","v":"SEVEN SEAS Fine Twill | modern | women"},53.550000000000004,"","3XL-4XL",2.7]
["SS730",{"$f":"IF(Selection!$B$4=\"DK\",VLOOKUP($A293,'Style navne sprog'!$A:$I,6,FALSE),IF(Selection!$B$4=\"DE\",VLOOKUP($A293,'Style navne sprog'!$A:$I,2,FALSE),IF(Selection!$B$4=\"GB\",VLOOKUP($A293,'Style navne sprog'!$A:$I,4,FALSE),IF(Selection!$B$4=\"SE\",VLOOKUP($A293,'Style navne sprog'!$A:$I,3,FALSE),IF(Selection!$B$4=\"NO\",VLOOKUP($A293,'Style navne sprog'!$A:$I,5,FALSE),IF(Selection!$B$4=\"PL\",VLOOKUP($A293,'Style navne sprog'!$A:$I,7,FALSE)))))))","v":"SEVEN SEAS Fine Twill California | modern | women"},53.550000000000004,"","3XL-4XL",2.7]
["SS740",{"$f":"IF(Selection!$B$4=\"DK\",VLOOKUP($A294,'Style navne sprog'!$A:$I,6,FALSE),IF(Selection!$B$4=\"DE\",VLOOKUP($A294,'Style navne sprog'!$A:$I,2,FALSE),IF(Selection!$B$4=\"GB\",VLOOKUP($A294,'Style navne sprog'!$A:$I,4,FALSE),IF(Selection!$B$4=\"SE\",VLOOKUP($A294,'Style navne sprog'!$A:$I,3,FALSE),IF(Selection!$B$4=\"NO\",VLOOKUP($A294,'Style navne sprog'!$A:$I,5,FALSE),IF(Selection!$B$4=\"PL\",VLOOKUP($A294,'Style navne sprog'!$A:$I,7,FALSE)))))))","v":"SEVEN SEAS Royal Oxford | modern | women"},53.550000000000004,"","3XL-4XL",2.7]
["SS770",{"$f":"IF(Selection!$B$4=\"DK\",VLOOKUP($A295,'Style navne sprog'!$A:$I,6,FALSE),IF(Selection!$B$4=\"DE\",VLOOKUP($A295,'Style navne sprog'!$A:$I,2,FALSE),IF(Selection!$B$4=\"GB\",VLOOKUP($A295,'Style navne sprog'!$A:$I,4,FALSE),IF(Selection!$B$4=\"SE\",VLOOKUP($A295,'Style navne sprog'!$A:$I,3,FALSE),IF(Selection!$B$4=\"NO\",VLOOKUP($A295,'Style navne sprog'!$A:$I,5,FALSE),IF(Selection!$B$4=\"PL\",VLOOKUP($A295,'Style navne sprog'!$A:$I,7,FALSE)))))))","v":"SEVEN SEAS Soft Denim | modern | women"},53.550000000000004,"","3XL-4XL",2.7]
["SS8",{"$f":"IF(Selection!$B$4=\"DK\",VLOOKUP($A296,'Style navne sprog'!$A:$I,6,FALSE),IF(Selection!$B$4=\"DE\",VLOOKUP($A296,'Style navne sprog'!$A:$I,2,FALSE),IF(Selection!$B$4=\"GB\",VLOOKUP($A296,'Style navne sprog'!$A:$I,4,FALSE),IF(Selection!$B$4=\"SE\",VLOOKUP($A296,'Style navne sprog'!$A:$I,3,FALSE),IF(Selection!$B$4=\"NO\",VLOOKUP($A296,'Style navne sprog'!$A:$I,5,FALSE),IF(Selection!$B$4=\"PL\",VLOOKUP($A296,'Style navne sprog'!$A:$I,7,FALSE)))))))","v":"SEVEN SEAS Fine Twill | modern"},53.550000000000004,"","3XL-5XL",2.7]

{"sheet":"Factor","index":2,"n_rows":296,"n_cols":7,"rows_kept":296,"cut":false,"hidden":false,"merged":[[4,4,4,5]]}
["Style","Beskrivelse"]
["a","a",0,null,null,0]
["NO.",{"$f":"IF(Selection!$B$4=\"DK\",\"PRODUKTNAVN\",IF(Selection!$B$4=\"DE\",\"PRODUKTNAME\",IF(Selection!$B$4=\"GB\",\"PRODUCT NAME\",IF(Selection!$B$4=\"SE\",\"PRODUKTNAMN\",IF(Selection!$B$4=\"NO\",\"PRODUKTNAVN\",IF(Selection!$B$4=\"PL\",\"NAZWA PRODUKTU\"))))))","v":"PRODUCT NAME"},{"$f":"IF(Selection!$B$4=\"GB\",\"PRICE VAT EXCLUSIVE\",\"PREIS EX. MWST.\")","v":"PRICE VAT EXCLUSIVE"}]
["-",null,"EUR",null,{"$f":"IF(Selection!$B$4=\"GB\",\"SIZE ADD-ON EUR\",\"GRÖSSEN ZZGL.EUR\")","v":"SIZE ADD-ON EUR"}]
[null,null,{"$f":"IF(Selection!$B$4=\"GB\",\"1 pcs\",\"1 Stück\")","v":"1 pcs"},"100 pcs",{"$f":"IF(Selection!$B$4=\"GB\",\"1 pcs\",\"1 Stück\")","v":"1 pcs"}]
[]
[{"$f":"IF(Selection!$B$4=\"PL\",\"T-SHIRTY\",IF(Selection!$B$4=\"NO\",\"T-SKJORTER\",\"T-SHIRTS\"))","v":"T-SHIRTS"}]
["0500",{"$f":"IF(Selection!$B$4=\"DK\",VLOOKUP($A8,'Style navne sprog'!$A:$I,6,FALSE),IF(Selection!$B$4=\"DE\",VLOOKUP($A8,'Style navne sprog'!$A:$I,2,FALSE),IF(Selection!$B$4=\"GB\",VLOOKUP($A8,'Style navne sprog'!$A:$I,4,FALSE),IF(Selection!$B$4=\"SE\",VLOOKUP($A8,'Style navne sprog'!$A:$I,3,FALSE),IF(Selection!$B$4=\"NO\",VLOOKUP($A8,'Style navne sprog'!$A:$I,5,FALSE),IF(Selection!$B$4=\"PL\",VLOOKUP($A8,'Style navne sprog'!$A:$I,7,FALSE)))))))","v":"GAME® T-shirt"},{"$f":"IF(Master!C8<>\"\",Master!C8*Selection!$B$3,\"\")","v":16.900000000000002},{"$f":"IF(Master!D8<>\"\",Master!D8*Selection!$B$3,\"\")","v":15.600000000000001},"3XL",{"$f":"IF(Master!F8<>\"\",Master!F8*Selection!$B$3,\"\")","v":2.8000000000000003},{"$f":"IF(Factor!#REF!<>\"\",Factor!#REF!*Selection!$B$3,\"\")","v":{"$error":"#REF!"}}]
["0502",{"$f":"IF(Selection!$B$4=\"DK\",VLOOKUP($A9,'Style navne sprog'!$A:$I,6,FALSE),IF(Selection!$B$4=\"DE\",VLOOKUP($A9,'Style navne sprog'!$A:$I,2,FALSE),IF(Selection!$B$4=\"GB\",VLOOKUP($A9,'Style navne sprog'!$A:$I,4,FALSE),IF(Selection!$B$4=\"SE\",VLOOKUP($A9,'Style navne sprog'!$A:$I,3,FALSE),IF(Selection!$B$4=\"NO\",VLOOKUP($A9,'Style navne sprog'!$A:$I,5,FALSE),IF(Selection!$B$4=\"PL\",VLOOKUP($A9,'Style navne sprog'!$A:$I,7,FALSE)))))))","v":"T-TIME® T-shirt | tight"},{"$f":"IF(Master!C9<>\"\",Master!C9*Selection!$B$3,\"\")","v":21.1},{"$f":"IF(Master!D9<>\"\",Master!D9*Selection!$B$3,\"\")","v":19.700000000000003},"3XL",{"$f":"IF(Master!F9<>\"\",Master!F9*Selection!$B$3,\"\")","v":2.8000000000000003},{"$f":"IF(Factor!#REF!<>\"\",Factor!#REF!*Selection!$B$3,\"\")","v":{"$error":"#REF!"}}]
["0506",{"$f":"IF(Selection!$B$4=\"DK\",VLOOKUP($A10,'Style navne sprog'!$A:$I,6,FALSE),IF(Selection!$B$4=\"DE\",VLOOKUP($A10,'Style navne sprog'!$A:$I,2,FALSE),IF(Selection!$B$4=\"GB\",VLOOKUP($A10,'Style navne sprog'!$A:$I,4,FALSE),IF(Selection!$B$4=\"SE\",VLOOKUP($A10,'Style navne sprog'!$A:$I,3,FALSE),IF(Selection!$B$4=\"NO\",VLOOKUP($A10,'Style navne sprog'!$A:$I,5,FALSE),IF(Selection!$B$4=\"PL\",VLOOKUP($A10,'Style navne sprog'!$A:$I,7,FALSE)))))))","v":"Interlock T-shirt | v-neck | women"},{"$f":"IF(Master!C10<>\"\",Master!C10*Selection!$B$3,\"\")","v":29.5},{"$f":"IF(Master!D10<>\"\",Master!D10*Selection!$B$3,\"\")","v":28.200000000000003},"3XL-4XL",{"$f":"IF(Master!F10<>\"\",Master!F10*Selection!$B$3,\"\")","v":2.8000000000000003},{"$f":"IF(Factor!#REF!<>\"\",Factor!#REF!*Selection!$B$3,\"\")","v":{"$error":"#REF!"}}]
["0508",{"$f":"IF(Selection!$B$4=\"DK\",VLOOKUP($A11,'Style navne sprog'!$A:$I,6,FALSE),IF(Selection!$B$4=\"DE\",VLOOKUP($A11,'Style navne sprog'!$A:$I,2,FALSE),IF(Selection!$B$4=\"GB\",VLOOKUP($A11,'Style navne sprog'!$A:$I,4,FALSE),IF(Selection!$B$4=\"SE\",VLOOKUP($A11,'Style navne sprog'!$A:$I,3,FALSE),IF(Selection!$B$4=\"NO\",VLOOKUP($A11,'Style navne sprog'!$A:$I,5,FALSE),IF(Selection!$B$4=\"PL\",VLOOKUP($A11,'Style navne sprog'!$A:$I,7,FALSE)))))))","v":"Interlock T-shirt | women"},{"$f":"IF(Master!C11<>\"\",Master!C11*Selection!$B$3,\"\")","v":29.5},{"$f":"IF(Master!D11<>\"\",Master!D11*Selection!$B$3,\"\")","v":28.200000000000003},"3XL-4XL",{"$f":"IF(Master!F11<>\"\",Master!F11*Selection!$B$3,\"\")","v":2.8000000000000003},{"$f":"IF(Factor!#REF!<>\"\",Factor!#REF!*Selection!$B$3,\"\")","v":{"$error":"#REF!"}}]
["0509",{"$f":"IF(Selection!$B$4=\"DK\",VLOOKUP($A12,'Style navne sprog'!$A:$I,6,FALSE),IF(Selection!$B$4=\"DE\",VLOOKUP($A12,'Style navne sprog'!$A:$I,2,FALSE),IF(Selection!$B$4=\"GB\",VLOOKUP($A12,'Style navne sprog'!$A:$I,4,FALSE),IF(Selection!$B$4=\"SE\",VLOOKUP($A12,'Style navne sprog'!$A:$I,3,FALSE),IF(Selection!$B$4=\"NO\",VLOOKUP($A12,'Style navne sprog'!$A:$I,5,FALSE),IF(Selection!$B$4=\"PL\",VLOOKUP($A12,'Style navne sprog'!$A:$I,7,FALSE)))))))","v":"Interlock T-shirt | long-sleeved | women"},{"$f":"IF(Master!C12<>\"\",Master!C12*Selection!$B$3,\"\")","v":37.4},{"$f":"IF(Master!D12<>\"\",Master!D12*Selection!$B$3,\"\")","v":36.1},"3XL-4XL",{"$f":"IF(Master!F12<>\"\",Master!F12*Selection!$B$3,\"\")","v":2.8000000000000003},{"$f":"IF(Factor!#REF!<>\"\",Factor!#REF!*Selection!$B$3,\"\")","v":{"$error":"#REF!"}}]
["0510",{"$f":"IF(Selection!$B$4=\"DK\",VLOOKUP($A13,'Style navne sprog'!$A:$I,6,FALSE),IF(Selection!$B$4=\"DE\",VLOOKUP($A13,'Style navne sprog'!$A:$I,2,FALSE),IF(Selection!$B$4=\"GB\",VLOOKUP($A13,'Style navne sprog'!$A:$I,4,FALSE),IF(Selection!$B$4=\"SE\",VLOOKUP($A13,'Style navne sprog'!$A:$I,3,FALSE),IF(Selection!$B$4=\"NO\",VLOOKUP($A13,'Style navne sprog'!$A:$I,5,FALSE),IF(Selection!$B$4=\"PL\",VLOOKUP($A13,'Style navne sprog'!$A:$I,7,FALSE)))))))","v":"T-TIME® T-shirt"},{"$f":"IF(Master!C13<>\"\",Master!C13*Selection!$B$3,\"\")","v":21.1},{"$f":"IF(Master!D13<>\"\",Master!D13*Selection!$B$3,\"\")","v":19.700000000000003},"3XL-6XL",{"$f":"IF(Master!F13<>\"\",Master!F13*Selection!$B$3,\"\")","v":2.8000000000000003},{"$f":"IF(Factor!#REF!<>\"\",Factor!#REF!*Selection!$B$3,\"\")","v":{"$error":"#REF!"}}]
["0511",{"$f":"IF(Selection!$B$4=\"DK\",VLOOKUP($A14,'Style navne sprog'!$A:$I,6,FALSE),IF(Selection!$B$4=\"DE\",VLOOKUP($A14,'Style navne sprog'!$A:$I,2,FALSE),IF(Selection!$B$4=\"GB\",VLOOKUP($A14,'Style navne sprog'!$A:$I,4,FALSE),IF(Selection!$B$4=\"SE\",VLOOKUP($A14,'Style navne sprog'!$A:$I,3,FALSE),IF(Selection!$B$4=\"NO\",VLOOKUP($A14,'Style navne sprog'!$A:$I,5,FALSE),IF(Selection!$B$4=\"PL\",VLOOKUP($A14,'Style navne sprog'!$A:$I,7,FALSE)))))))","v":"T-TIME® T-shirt | women"},{"$f":"IF(Master!C14<>\"\",Master!C14*Selection!$B$3,\"\")","v":21.1},{"$f":"IF(Master!D14<>\"\",Master!D14*Selection!$B$3,\"\")","v":19.700000000000003},"3XL-6XL",{"$f":"IF(Master!F14<>\"\",Master!F14*Selection!$B$3,\"\")","v":2.8000000000000003},{"$f":"IF(Factor!#REF!<>\"\",Factor!#REF!*Selection!$B$3,\"\")","v":{"$error":"#REF!"}}]
["0514",{"$f":"IF(Selection!$B$4=\"DK\",VLOOKUP($A15,'Style navne sprog'!$A:$I,6,FALSE),IF(Selection!$B$4=\"DE\",VLOOKUP($A15,'Style navne sprog'!$A:$I,2,FALSE),IF(Selection!$B$4=\"GB\",VLOOKUP($A15,'Style navne sprog'!$A:$I,4,FALSE),IF(Selection!$B$4=\"SE\",VLOOKUP($A15,'Style navne sprog'!$A:$I,3,FALSE),IF(Selection!$B$4=\"NO\",VLOOKUP($A15,'Style navne sprog'!$A:$I,5,FALSE),IF(Selection!$B$4=\"PL\",VLOOKUP($A15,'Style navne sprog'!$A:$I,7,FALSE)))))))","v":"T-TIME® T-shirt | v-neck"},{"$f":"IF(Master!C15<>\"\",Master!C15*Selection!$B$3,\"\")","v":21.1},{"$f":"IF(Master!D15<>\"\",Master!D15*Selection!$B$3,\"\")","v":19.700000000000003},"",{"$f":"IF(Master!F15<>\"\",Master!F15*Selection!$B$3,\"\")","v":""},{"$f":"IF(Factor!#REF!<>\"\",Factor!#REF!*Selection!$B$3,\"\")","v":{"$error":"#REF!"}}]
["0517",{"$f":"IF(Selection!$B$4=\"DK\",VLOOKUP($A16,'Style navne sprog'!$A:$I,6,FALSE),IF(Selection!$B$4=\"DE\",VLOOKUP($A16,'Style navne sprog'!$A:$I,2,FALSE),IF(Selection!$B$4=\"GB\",VLOOKUP($A16,'Style navne sprog'!$A:$I,4,FALSE),IF(Selection!$B$4=\"SE\",VLOOKUP($A16,'Style navne sprog'!$A:$I,3,FALSE),IF(Selection!$B$4=\"NO\",VLOOKUP($A16,'Style navne sprog'!$A:$I,5,FALSE),IF(Selection!$B$4=\"PL\",VLOOKUP($A16,'Style navne sprog'!$A:$I,7,FALSE)))))))","v":"Interlock T-shirt"},{"$f":"IF(Master!C16<>\"\",Master!C16*Selection!$B$3,\"\")","v":29.5},{"$f":"IF(Master!D16<>\"\",Master!D16*Selection!$B$3,\"\")","v":28.200000000000003},"3XL",{"$f":"IF(Master!F16<>\"\",Master!F16*Selection!$B$3,\"\")","v":2.8000000000000003},{"$f":"IF(Factor!#REF!<>\"\",Factor!#REF!*Selection!$B$3,\"\")","v":{"$error":"#REF!"}}]
["0518",{"$f":"IF(Selection!$B$4=\"DK\",VLOOKUP($A17,'Style navne sprog'!$A:$I,6,FALSE),IF(Selection!$B$4=\"DE\",VLOOKUP($A17,'Style navne sprog'!$A:$I,2,FALSE),IF(Selection!$B$4=\"GB\",VLOOKUP($A17,'Style navne sprog'!$A:$I,4,FALSE),IF(Selection!$B$4=\"SE\",VLOOKUP($A17,'Style navne sprog'!$A:$I,3,FALSE),IF(Selection!$B$4=\"NO\",VLOOKUP($A17,'Style navne sprog'!$A:$I,5,FALSE),IF(Selection!$B$4=\"PL\",VLOOKUP($A17,'Style navne sprog'!$A:$I,7,FALSE)))))))","v":"Interlock T-shirt | long-sleeved"},{"$f":"IF(Master!C17<>\"\",Master!C17*Selection!$B$3,\"\")","v":37.4},{"$f":"IF(Master!D17<>\"\",Master!D17*Selection!$B$3,\"\")","v":36.1},"3XL",{"$f":"IF(Master!F17<>\"\",Master!F17*Selection!$B$3,\"\")","v":2.8000000000000003},{"$f":"IF(Factor!#REF!<>\"\",Factor!#REF!*Selection!$B$3,\"\")","v":{"$error":"#REF!"}}]
["0524",{"$f":"IF(Selection!$B$4=\"DK\",VLOOKUP($A18,'Style navne sprog'!$A:$I,6,FALSE),IF(Selection!$B$4=\"DE\",VLOOKUP($A18,'Style navne sprog'!$A:$I,2,FALSE),IF(Selection!$B$4=\"GB\",VLOOKUP($A18,'Style navne sprog'!$A:$I,4,FALSE),IF(Selection!$B$4=\"SE\",VLOOKUP($A18,'Style navne sprog'!$A:$I,3,FALSE),IF(Selection!$B$4=\"NO\",VLOOKUP($A18,'Style navne sprog'!$A:$I,5,FALSE),IF(Selection!$B$4=\"PL\",VLOOKUP($A18,'Style navne sprog'!$A:$I,7,FALSE)))))))","v":"RE-CARE T-shirt | unisex"},{"$f":"IF(Master!C18<>\"\",Master!C18*Selection!$B$3,\"\")","v":42.7},{"$f":"IF(Master!D18<>\"\",Master!D18*Selection!$B$3,\"\")","v":41.300000000000004},"3XL-4XL",{"$f":"IF(Master!F18<>\"\",Master!F18*Selection!$B$3,\"\")","v":2.8000000000000003},{"$f":"IF(Factor!#REF!<>\"\",Factor!#REF!*Selection!$B$3,\"\")","v":{"$error":"#REF!"}}]
["0528",{"$f":"IF(Selection!$B$4=\"DK\",VLOOKUP($A19,'Style navne sprog'!$A:$I,6,FALSE),IF(Selection!$B$4=\"DE\",VLOOKUP($A19,'Style navne sprog'!$A:$I,2,FALSE),IF(Selection!$B$4=\"GB\",VLOOKUP($A19,'Style navne sprog'!$A:$I,4,FALSE),IF(Selection!$B$4=\"SE\",VLOOKUP($A19,'Style navne sprog'!$A:$I,3,FALSE),IF(Selection!$B$4=\"NO\",VLOOKUP($A19,'Style navne sprog'!$A:$I,5,FALSE),IF(Selection!$B$4=\"PL\",VLOOKUP($A19,'Style navne sprog'!$A:$I,7,FALSE)))))))","v":"T-shirt Lyocell"},{"$f":"IF(Master!C19<>\"\",Master!C19*Selection!$B$3,\"\")","v":39.200000000000003},{"$f":"IF(Master!D19<>\"\",Master!D19*Selection!$B$3,\"\")","v":37.9},"3XL-6XL",{"$f":"IF(Master!F19<>\"\",Master!F19*Selection!$B$3,\"\")","v":2.8000000000000003},{"$f":"IF(Factor!#REF!<>\"\",Factor!#REF!*Selection!$B$3,\"\")","v":{"$error":"#REF!"}}]
["0529",{"$f":"IF(Selection!$B$4=\"DK\",VLOOKUP($A20,'Style navne sprog'!$A:$I,6,FALSE),IF(Selection!$B$4=\"DE\",VLOOKUP($A20,'Style navne sprog'!$A:$I,2,FALSE),IF(Selection!$B$4=\"GB\",VLOOKUP($A20,'Style navne sprog'!$A:$I,4,FALSE),IF(Selection!$B$4=\"SE\",VLOOKUP($A20,'Style navne sprog'!$A:$I,3,FALSE),IF(Selection!$B$4=\"NO\",VLOOKUP($A20,'Style navne sprog'!$A:$I,5,FALSE),IF(Selection!$B$4=\"PL\",VLOOKUP($A20,'Style navne sprog'!$A:$I,7,FALSE)))))))","v":"T-shirt Lyocell | women"},{"$f":"IF(Master!C20<>\"\",Master!C20*Selection!$B$3,\"\")","v":39.200000000000003},{"$f":"IF(Master!D20<>\"\",Master!D20*Selection!$B$3,\"\")","v":37.9},"3XL-6XL",{"$f":"IF(Master!F20<>\"\",Master!F20*Selection!$B$3,\"\")","v":2.8000000000000003},{"$f":"IF(Factor!#REF!<>\"\",Factor!#REF!*Selection!$B$3,\"\")","v":{"$error":"#REF!"}}]
["0546",{"$f":"IF(Selection!$B$4=\"DK\",VLOOKUP($A21,'Style navne sprog'!$A:$I,6,FALSE),IF(Selection!$B$4=\"DE\",VLOOKUP($A21,'Style navne sprog'!$A:$I,2,FALSE),IF(Selection!$B$4=\"GB\",VLOOKUP($A21,'Style navne sprog'!$A:$I,4,FALSE),IF(Selection!$B$4=\"SE\",VLOOKUP($A21,'Style navne sprog'!$A:$I,3,FALSE),IF(Selection!$B$4=\"NO\",VLOOKUP($A21,'Style navne sprog'!$A:$I,5,FALSE),IF(Selection!$B$4=\"PL\",VLOOKUP($A21,'Style navne sprog'!$A:$I,7,FALSE)))))))","v":"T-TIME® T-shirt | turtleneck"},{"$f":"IF(Master!C21<>\"\",Master!C21*Selection!$B$3,\"\")","v":47.7},{"$f":"IF(Master!D21<>\"\",Master!D21*Selection!$B$3,\"\")","v":46.300000000000004},"",{"$f":"IF(Master!F21<>\"\",Master!F21*Selection!$B$3,\"\")","v":""},{"$f":"IF(Factor!#REF!<>\"\",Factor!#REF!*Selection!$B$3,\"\")","v":{"$error":"#REF!"}}]
["0550",{"$f":"IF(Selection!$B$4=\"DK\",VLOOKUP($A22,'Style navne sprog'!$A:$I,6,FALSE),IF(Selection!$B$4=\"DE\",VLOOKUP($A22,'Style navne sprog'!$A:$I,2,FALSE),IF(Selection!$B$4=\"GB\",VLOOKUP($A22,'Style navne sprog'!$A:$I,4,FALSE),IF(Selection!$B$4=\"SE\",VLOOKUP($A22,'Style navne sprog'!$A:$I,3,FALSE),IF(Selection!$B$4=\"NO\",VLOOKUP($A22,'Style navne sprog'!$A:$I,5,FALSE),IF(Selection!$B$4=\"PL\",VLOOKUP($A22,'Style navne sprog'!$A:$I,7,FALSE)))))))","v":"T-TIME® T-shirt | chest pocket"},{"$f":"IF(Master!C22<>\"\",Master!C22*Selection!$B$3,\"\")","v":25.200000000000003},{"$f":"IF(Master!D22<>\"\",Master!D22*Selection!$B$3,\"\")","v":23.900000000000002},"3XL",{"$f":"IF(Master!F22<>\"\",Master!F22*Selection!$B$3,\"\")","v":2.8000000000000003},{"$f":"IF(Factor!#REF!<>\"\",Factor!#REF!*Selection!$B$3,\"\")","v":{"$error":"#REF!"}}]
["0552",{"$f":"IF(Selection!$B$4=\"DK\",VLOOKUP($A23,'Style navne sprog'!$A:$I,6,FALSE),IF(Selection!$B$4=\"DE\",VLOOKUP($A23,'Style navne sprog'!$A:$I,2,FALSE),IF(Selection!$B$4=\"GB\",VLOOKUP($A23,'Style navne sprog'!$A:$I,4,FALSE),IF(Selection!$B$4=\"SE\",VLOOKUP($A23,'Style navne sprog'!$A:$I,3,FALSE),IF(Selection!$B$4=\"NO\",VLOOKUP($A23,'Style navne sprog'!$A:$I,5,FALSE),IF(Selection!$B$4=\"PL\",VLOOKUP($A23,'Style navne sprog'!$A:$I,7,FALSE)))))))","v":"T-shirt | organic"},{"$f":"IF(Master!C23<>\"\",Master!C23*Selection!$B$3,\"\")","v":24},{"$f":"IF(Master!D23<>\"\",Master!D23*Selection!$B$3,\"\")","v":22.700000000000003},"3XL-4XL",{"$f":"IF(Master!F23<>\"\",Master!F23*Selection!$B$3,\"\")","v":2.8000000000000003},{"$f":"IF(Factor!#REF!<>\"\",Factor!#REF!*Selection!$B$3,\"\")","v":{"$error":"#REF!"}}]
["0553",{"$f":"IF(Selection!$B$4=\"DK\",VLOOKUP($A24,'Style navne sprog'!$A:$I,6,FALSE),IF(Selection!$B$4=\"DE\",VLOOKUP($A24,'Style navne sprog'!$A:$I,2,FALSE),IF(Selection!$B$4=\"GB\",VLOOKUP($A24,'Style navne sprog'!$A:$I,4,FALSE),IF(Selection!$B$4=\"SE\",VLOOKUP($A24,'Style navne sprog'!$A:$I,3,FALSE),IF(Selection!$B$4=\"NO\",VLOOKUP($A24,'Style navne sprog'!$A:$I,5,FALSE),IF(Selection!$B$4=\"PL\",VLOOKUP($A24,'Style navne sprog'!$A:$I,7,FALSE)))))))","v":"T-shirt | organic | women"},{"$f":"IF(Master!C24<>\"\",Master!C24*Selection!$B$3,\"\")","v":24},{"$f":"IF(Master!D24<>\"\",Master!D24*Selection!$B$3,\"\")","v":22.700000000000003},"3XL",{"$f":"IF(Master!F24<>\"\",Master!F24*Selection!$B$3,\"\")","v":2.8000000000000003},{"$f":"IF(Factor!#REF!<>\"\",Factor!#REF!*Selection!$B$3,\"\")","v":{"$error":"#REF!"}}]
["0594",{"$f":"IF(Selection!$B$4=\"DK\",VLOOKUP($A25,'Style navne sprog'!$A:$I,6,FALSE),IF(Selection!$B$4=\"DE\",VLOOKUP($A25,'Style navne sprog'!$A:$I,2,FALSE),IF(Selection!$B$4=\"GB\",VLOOKUP($A25,'Style navne sprog'!$A:$I,4,FALSE),IF(Selection!$B$4=\"SE\",VLOOKUP($A25,'Style navne sprog'!$A:$I,3,FALSE),IF(Selection!$B$4=\"NO\",VLOOKUP($A25,'Style navne sprog'!$A:$I,5,FALSE),IF(Selection!$B$4=\"PL\",VLOOKUP($A25,'Style navne sprog'!$A:$I,7,FALSE)))))))","v":"Stretch T-shirt | comfort"},{"$f":"IF(Master!C25<>\"\",Master!C25*Selection!$B$3,\"\")","v":28.1},{"$f":"IF(Master!D25<>\"\",Master!D25*Selection!$B$3,\"\")","v":26.700000000000003},"3XL",{"$f":"IF(Master!F25<>\"\",Master!F25*Selection!$B$3,\"\")","v":2.8000000000000003},{"$f":"IF(Factor!#REF!<>\"\",Factor!#REF!*Selection!$B$3,\"\")","v":{"$error":"#REF!"}}]
["0595",{"$f":"IF(Selection!$B$4=\"DK\",VLOOKUP($A26,'Style navne sprog'!$A:$I,6,FALSE),IF(Selection!$B$4=\"DE\",VLOOKUP($A26,'Style navne sprog'!$A:$I,2,FALSE),IF(Selection!$B$4=\"GB\",VLOOKUP($A26,'Style navne sprog'!$A:$I,4,FALSE),IF(Selection!$B$4=\"SE\",VLOOKUP($A26,'Style navne sprog'!$A:$I,3,FALSE),IF(Selection!$B$4=\"NO\",VLOOKUP($A26,'Style navne sprog'!$A:$I,5,FALSE),IF(Selection!$B$4=\"PL\",VLOOKUP($A26,'Style navne sprog'!$A:$I,7,FALSE)))))))","v":"Stretch T-shirt | comfort | women"},{"$f":"IF(Master!C26<>\"\",Master!C26*Selection!$B$3,\"\")","v":28.1},{"$f":"IF(Master!D26<>\"\",Master!D26*Selection!$B$3,\"\")","v":26.700000000000003},"3XL",{"$f":"IF(Master!F26<>\"\",Master!F26*Selection!$B$3,\"\")","v":2.8000000000000003},{"$f":"IF(Factor!#REF!<>\"\",Factor!#REF!*Selection!$B$3,\"\")","v":{"$error":"#REF!"}}]
["0597",{"$f":"IF(Selection!$B$4=\"DK\",VLOOKUP($A27,'Style navne sprog'!$A:$I,6,FALSE),IF(Selection!$B$4=\"DE\",VLOOKUP($A27,'Style navne sprog'!$A:$I,2,FALSE),IF(Selection!$B$4=\"GB\",VLOOKUP($A27,'Style navne sprog'!$A:$I,4,FALSE),IF(Selection!$B$4=\"SE\",VLOOKUP($A27,'Style navne sprog'!$A:$I,3,FALSE),IF(Selection!$B$4=\"NO\",VLOOKUP($A27,'Style navne sprog'!$A:$I,5,FALSE),IF(Selection!$B$4=\"PL\",VLOOKUP($A27,'Style navne sprog'!$A:$I,7,FALSE)))))))","v":"Stretch T-shirt | ¾ sleeved | women"},{"$f":"IF(Master!C27<>\"\",Master!C27*Selection!$B$3,\"\")","v":37.300000000000004},{"$f":"IF(Master!D27<>\"\",Master!D27*Selection!$B$3,\"\")","v":36},"3XL",{"$f":"IF(Master!F27<>\"\",Master!F27*Selection!$B$3,\"\")","v":2.8000000000000003},{"$f":"IF(Factor!#REF!<>\"\",Factor!#REF!*Selection!$B$3,\"\")","v":{"$error":"#REF!"}}]
["0598",{"$f":"IF(Selection!$B$4=\"DK\",VLOOKUP($A28,'Style navne sprog'!$A:$I,6,FALSE),IF(Selection!$B$4=\"DE\",VLOOKUP($A28,'Style navne sprog'!$A:$I,2,FALSE),IF(Selection!$B$4=\"GB\",VLOOKUP($A28,'Style navne sprog'!$A:$I,4,FALSE),IF(Selection!$B$4=\"SE\",VLOOKUP($A28,'Style navne sprog'!$A:$I,3,FALSE),IF(Selection!$B$4=\"NO\",VLOOKUP($A28,'Style navne sprog'!$A:$I,5,FALSE),IF(Selection!$B$4=\"PL\",VLOOKUP($A28,'Style navne sprog'!$A:$I,7,FALSE)))))))","v":"Tank top | stretch"},{"$f":"IF(Master!C28<>\"\",Master!C28*Selection!$B$3,\"\")","v":26.6},{"$f":"IF(Master!D28<>\"\",Master!D28*Selection!$B$3,\"\")","v":25.200000000000003},"3XL",{"$f":"IF(Master!F28<>\"\",Master!F28*Selection!$B$3,\"\")","v":2.8000000000000003},{"$f":"IF(Factor!#REF!<>\"\",Factor!#REF!*Selection!$B$3,\"\")","v":{"$error":"#REF!"}}]
["0599",{"$f":"IF(Selection!$B$4=\"DK\",VLOOKUP($A29,'Style navne sprog'!$A:$I,6,FALSE),IF(Selection!$B$4=\"DE\",VLOOKUP($A29,'Style navne sprog'!$A:$I,2,FALSE),IF(Selection!$B$4=\"GB\",VLOOKUP($A29,'Style navne sprog'!$A:$I,4,FALSE),IF(Selection!$B$4=\"SE\",VLOOKUP($A29,'Style navne sprog'!$A:$I,3,FALSE),IF(Selection!$B$4=\"NO\",VLOOKUP($A29,'Style navne sprog'!$A:$I,5,FALSE),IF(Selection!$B$4=\"PL\",VLOOKUP($A29,'Style navne sprog'!$A:$I,7,FALSE)))))))","v":"Tank top | stretch | women"},{"$f":"IF(Master!C29<>\"\",Master!C29*Selection!$B$3,\"\")","v":26.6},{"$f":"IF(Master!D29<>\"\",Master!D29*Selection!$B$3,\"\")","v":25.200000000000003},"3XL",{"$f":"IF(Master!F29<>\"\",Master!F29*Selection!$B$3,\"\")","v":2.8000000000000003},{"$f":"IF(Factor!#REF!<>\"\",Factor!#REF!*Selection!$B$3,\"\")","v":{"$error":"#REF!"}}]
["2000",{"$f":"IF(Selection!$B$4=\"DK\",VLOOKUP($A30,'Style navne sprog'!$A:$I,6,FALSE),IF(Selection!$B$4=\"DE\",VLOOKUP($A30,'Style navne sprog'!$A:$I,2,FALSE),IF(Selection!$B$4=\"GB\",VLOOKUP($A30,'Style navne sprog'!$A:$I,4,FALSE),IF(Selection!$B$4=\"SE\",VLOOKUP($A30,'Style navne sprog'!$A:$I,3,FALSE),IF(Selection!$B$4=\"NO\",VLOOKUP($A30,'Style navne sprog'!$A:$I,5,FALSE),IF(Selection!$B$4=\"PL\",VLOOKUP($A30,'Style navne sprog'!$A:$I,7,FALSE)))))))","v":"YES T-shirt"},{"$f":"IF(Master!C30<>\"\",Master!C30*Selection!$B$3,\"\")","v":14},{"$f":"IF(Master!D30<>\"\",Master!D30*Selection!$B$3,\"\")","v":12.600000000000001},"3XL",{"$f":"IF(Master!F30<>\"\",Master!F30*Selection!$B$3,\"\")","v":2.8000000000000003},{"$f":"IF(Factor!#REF!<>\"\",Factor!#REF!*Selection!$B$3,\"\")","v":{"$error":"#REF!"}}]
["2030",{"$f":"IF(Selection!$B$4=\"DK\",VLOOKUP($A31,'Style navne sprog'!$A:$I,6,FALSE),IF(Selection!$B$4=\"DE\",VLOOKUP($A31,'Style navne sprog'!$A:$I,2,FALSE),IF(Selection!$B$4=\"GB\",VLOOKUP($A31,'Style navne sprog'!$A:$I,4,FALSE),IF(Selection!$B$4=\"SE\",VLOOKUP($A31,'Style navne sprog'!$A:$I,3,FALSE),IF(Selection!$B$4=\"NO\",VLOOKUP($A31,'Style navne sprog'!$A:$I,5,FALSE),IF(Selection!$B$4=\"PL\",VLOOKUP($A31,'Style navne sprog'!$A:$I,7,FALSE)))))))","v":"YES Active T-shirt"},{"$f":"IF(Master!C31<>\"\",Master!C31*Selection!$B$3,\"\")","v":21.200000000000003},{"$f":"IF(Master!D31<>\"\",Master!D31*Selection!$B$3,\"\")","v":19.900000000000002},"3XL",{"$f":"IF(Master!F31<>\"\",Master!F31*Selection!$B$3,\"\")","v":2.8000000000000003},{"$f":"IF(Factor!#REF!<>\"\",Factor!#REF!*Selection!$B$3,\"\")","v":{"$error":"#REF!"}}]
["2032",{"$f":"IF(Selection!$B$4=\"DK\",VLOOKUP($A32,'Style navne sprog'!$A:$I,6,FALSE),IF(Selection!$B$4=\"DE\",VLOOKUP($A32,'Style navne sprog'!$A:$I,2,FALSE),IF(Selection!$B$4=\"GB\",VLOOKUP($A32,'Style navne sprog'!$A:$I,4,FALSE),IF(Selection!$B$4=\"SE\",VLOOKUP($A32,'Style navne sprog'!$A:$I,3,FALSE),IF(Selection!$B$4=\"NO\",VLOOKUP($A32,'Style navne sprog'!$A:$I,5,FALSE),IF(Selection!$B$4=\"PL\",VLOOKUP($A32,'Style navne sprog'!$A:$I,7,FALSE)))))))","v":"YES Active T-shirt | women"},{"$f":"IF(Master!C32<>\"\",Master!C32*Selection!$B$3,\"\")","v":21.200000000000003},{"$f":"IF(Master!D32<>\"\",Master!D32*Selection!$B$3,\"\")","v":19.900000000000002},"3XL",{"$f":"IF(Master!F32<>\"\",Master!F32*Selection!$B$3,\"\")","v":2.8000000000000003},{"$f":"IF(Factor!#REF!<>\"\",Factor!#REF!*Selection!$B$3,\"\")","v":{"$error":"#REF!"}}]
[]
[{"$f":"IF(Selection!$B$4=\"PL\",\"KOSZULKI POLO\",IF(Selection!$B$4=\"SE\",\"PIKÉ TRÖJOR\",IF(Selection!$B$4=\"GB\",\"POLO SHIRTS\",IF(Selection!$B$4=\"NO\",\"POLOSKJORTER\",\"POLOSHIRTS\"))))","v":"POLO SHIRTS"}]
["0520",{"$f":"IF(Selection!$B$4=\"DK\",VLOOKUP($A35,'Style navne sprog'!$A:$I,6,FALSE),IF(Selection!$B$4=\"DE\",VLOOKUP($A35,'Style navne sprog'!$A:$I,2,FALSE),IF(Selection!$B$4=\"GB\",VLOOKUP($A35,'Style navne sprog'!$A:$I,4,FALSE),IF(Selection!$B$4=\"SE\",VLOOKUP($A35,'Style navne sprog'!$A:$I,3,FALSE),IF(Selection!$B$4=\"NO\",VLOOKUP($A35,'Style navne sprog'!$A:$I,5,FALSE),IF(Selection!$B$4=\"PL\",VLOOKUP($A35,'Style navne sprog'!$A:$I,7,FALSE)))))))","v":"Polo shirt classic"},{"$f":"IF(Master!C35<>\"\",Master!C35*Selection!$B$3,\"\")","v":44.800000000000004},{"$f":"IF(Master!D35<>\"\",Master!D35*Selection!$B$3,\"\")","v":42.1},"3XL-6XL",{"$f":"IF(Master!F35<>\"\",Master!F35*Selection!$B$3,\"\")","v":5.4},{"$f":"IF(Factor!#REF!<>\"\",Factor!#REF!*Selection!$B$3,\"\")","v":{"$error":"#REF!"}}]
["0521",{"$f":"IF(Selection!$B$4=\"DK\",VLOOKUP($A36,'Style navne sprog'!$A:$I,6,FALSE),IF(Selection!$B$4=\"DE\",VLOOKUP($A36,'Style navne sprog'!$A:$I,2,FALSE),IF(Selection!$B$4=\"GB\",VLOOKUP($A36,'Style navne sprog'!$A:$I,4,FALSE),IF(Selection!$B$4=\"SE\",VLOOKUP($A36,'Style navne sprog'!$A:$I,3,FALSE),IF(Selection!$B$4=\"NO\",VLOOKUP($A36,'Style navne sprog'!$A:$I,5,FALSE),IF(Selection!$B$4=\"PL\",VLOOKUP($A36,'Style navne sprog'!$A:$I,7,FALSE)))))))","v":"Polo shirt classic | women"},{"$f":"IF(Master!C36<>\"\",Master!C36*Selection!$B$3,\"\")","v":44.800000000000004},{"$f":"IF(Master!D36<>\"\",Master!D36*Selection!$B$3,\"\")","v":42.1},"3XL",{"$f":"IF(Master!F36<>\"\",Master!F36*Selection!$B$3,\"\")","v":5.4},{"$f":"IF(Factor!#REF!<>\"\",Factor!#REF!*Selection!$B$3,\"\")","v":{"$error":"#REF!"}}]
["0522",{"$f":"IF(Selection!$B$4=\"DK\",VLOOKUP($A37,'Style navne sprog'!$A:$I,6,FALSE),IF(Selection!$B$4=\"DE\",VLOOKUP($A37,'Style navne sprog'!$A:$I,2,FALSE),IF(Selection!$B$4=\"GB\",VLOOKUP($A37,'Style navne sprog'!$A:$I,4,FALSE),IF(Selection!$B$4=\"SE\",VLOOKUP($A37,'Style navne sprog'!$A:$I,3,FALSE),IF(Selection!$B$4=\"NO\",VLOOKUP($A37,'Style navne sprog'!$A:$I,5,FALSE),IF(Selection!$B$4=\"PL\",VLOOKUP($A37,'Style navne sprog'!$A:$I,7,FALSE)))))))","v":"Contrast polo shirt | stretch"},{"$f":"IF(Master!C37<>\"\",Master!C37*Selection!$B$3,\"\")","v":52.6},{"$f":"IF(Master!D37<>\"\",Master!D37*Selection!$B$3,\"\")","v":49.900000000000006},"3XL-4XL",{"$f":"IF(Master!F37<>\"\",Master!F37*Selection!$B$3,\"\")","v":5.4},{"$f":"IF(Factor!#REF!<>\"\",Factor!#REF!*Selection!$B$3,\"\")","v":{"$error":"#REF!"}}]
["0523",{"$f":"IF(Selection!$B$4=\"DK\",VLOOKUP($A38,'Style navne sprog'!$A:$I,6,FALSE),IF(Selection!$B$4=\"DE\",VLOOKUP($A38,'Style navne sprog'!$A:$I,2,FALSE),IF(Selection!$B$4=\"GB\",VLOOKUP($A38,'Style navne sprog'!$A:$I,4,FALSE),IF(Selection!$B$4=\"SE\",VLOOKUP($A38,'Style navne sprog'!$A:$I,3,FALSE),IF(Selection!$B$4=\"NO\",VLOOKUP($A38,'Style navne sprog'!$A:$I,5,FALSE),IF(Selection!$B$4=\"PL\",VLOOKUP($A38,'Style navne sprog'!$A:$I,7,FALSE)))))))","v":"Contrast polo shirt | stretch | women"},{"$f":"IF(Master!C38<>\"\",Master!C38*Selection!$B$3,\"\")","v":52.6},{"$f":"IF(Master!D38<>\"\",Master!D38*Selection!$B$3,\"\")","v":49.900000000000006},"3XL-4XL",{"$f":"IF(Master!F38<>\"\",Master!F38*Selection!$B$3,\"\")","v":5.4},{"$f":"IF(Factor!#REF!<>\"\",Factor!#REF!*Selection!$B$3,\"\")","v":{"$error":"#REF!"}}]
["0525",{"$f":"IF(Selection!$B$4=\"DK\",VLOOKUP($A39,'Style navne sprog'!$A:$I,6,FALSE),IF(Selection!$B$4=\"DE\",VLOOKUP($A39,'Style navne sprog'!$A:$I,2,FALSE),IF(Selection!$B$4=\"GB\",VLOOKUP($A39,'Style navne sprog'!$A:$I,4,FALSE),IF(Selection!$B$4=\"SE\",VLOOKUP($A39,'Style navne sprog'!$A:$I,3,FALSE),IF(Selection!$B$4=\"NO\",VLOOKUP($A39,'Style navne sprog'!$A:$I,5,FALSE),IF(Selection!$B$4=\"PL\",VLOOKUP($A39,'Style navne sprog'!$A:$I,7,FALSE)))))))","v":"Polo shirt | stretch"},{"$f":"IF(Master!C39<>\"\",Master!C39*Selection!$B$3,\"\")","v":48.7},{"$f":"IF(Master!D39<>\"\",Master!D39*Selection!$B$3,\"\")","v":46},"3XL-6XL",{"$f":"IF(Master!F39<>\"\",Master!F39*Selection!$B$3,\"\")","v":5.4},{"$f":"IF(Factor!#REF!<>\"\",Factor!#REF!*Selection!$B$3,\"\")","v":{"$error":"#REF!"}}]
["0527",{"$f":"IF(Selection!$B$4=\"DK\",VLOOKUP($A40,'Style navne sprog'!$A:$I,6,FALSE),IF(Selection!$B$4=\"DE\",VLOOKUP($A40,'Style navne sprog'!$A:$I,2,FALSE),IF(Selection!$B$4=\"GB\",VLOOKUP($A40,'Style navne sprog'!$A:$I,4,FALSE),IF(Selection!$B$4=\"SE\",VLOOKUP($A40,'Style navne sprog'!$A:$I,3,FALSE),IF(Selection!$B$4=\"NO\",VLOOKUP($A40,'Style navne sprog'!$A:$I,5,FALSE),IF(Selection!$B$4=\"PL\",VLOOKUP($A40,'Style navne sprog'!$A:$I,7,FALSE)))))))","v":"Polo shirt | stretch | women"},{"$f":"IF(Master!C40<>\"\",Master!C40*Selection!$B$3,\"\")","v":48.7},{"$f":"IF(Master!D40<>\"\",Master!D40*Selection!$B$3,\"\")","v":46},"3XL-6XL",{"$f":"IF(Master!F40<>\"\",Master!F40*Selection!$B$3,\"\")","v":5.4},{"$f":"IF(Factor!#REF!<>\"\",Factor!#REF!*Selection!$B$3,\"\")","v":{"$error":"#REF!"}}]
["0534",{"$f":"IF(Selection!$B$4=\"DK\",VLOOKUP($A41,'Style navne sprog'!$A:$I,6,FALSE),IF(Selection!$B$4=\"DE\",VLOOKUP($A41,'Style navne sprog'!$A:$I,2,FALSE),IF(Selection!$B$4=\"GB\",VLOOKUP($A41,'Style navne sprog'!$A:$I,4,FALSE),IF(Selection!$B$4=\"SE\",VLOOKUP($A41,'Style navne sprog'!$A:$I,3,FALSE),IF(Selection!$B$4=\"NO\",VLOOKUP($A41,'Style navne sprog'!$A:$I,5,FALSE),IF(Selection!$B$4=\"PL\",VLOOKUP($A41,'Style navne sprog'!$A:$I,7,FALSE)))))))","v":"Business polo shirt | jersey"},{"$f":"IF(Master!C41<>\"\",Master!C41*Selection!$B$3,\"\")","v":64.3},{"$f":"IF(Master!D41<>\"\",Master!D41*Selection!$B$3,\"\")","v":""},"3XL-4XL",{"$f":"IF(Master!F41<>\"\",Master!F41*Selection!$B$3,\"\")","v":5.4},{"$f":"IF(Factor!#REF!<>\"\",Factor!#REF!*Selection!$B$3,\"\")","v":{"$error":"#REF!"}}]
["0535",{"$f":"IF(Selection!$B$4=\"DK\",VLOOKUP($A42,'Style navne sprog'!$A:$I,6,FALSE),IF(Selection!$B$4=\"DE\",VLOOKUP($A42,'Style navne sprog'!$A:$I,2,FALSE),IF(Selection!$B$4=\"GB\",VLOOKUP($A42,'Style navne sprog'!$A:$I,4,FALSE),IF(Selection!$B$4=\"SE\",VLOOKUP($A42,'Style navne sprog'!$A:$I,3,FALSE),IF(Selection!$B$4=\"NO\",VLOOKUP($A42,'Style navne sprog'!$A:$I,5,FALSE),IF(Selection!$B$4=\"PL\",VLOOKUP($A42,'Style navne sprog'!$A:$I,7,FALSE)))))))","v":"Business polo shirt | jersey | women"},{"$f":"IF(Master!C42<>\"\",Master!C42*Selection!$B$3,\"\")","v":64.3},{"$f":"IF(Master!D42<>\"\",Master!D42*Selection!$B$3,\"\")","v":""},"3XL",{"$f":"IF(Master!F42<>\"\",Master!F42*Selection!$B$3,\"\")","v":5.4},{"$f":"IF(Factor!#REF!<>\"\",Factor!#REF!*Selection!$B$3,\"\")","v":{"$error":"#REF!"}}]
["0544",{"$f":"IF(Selection!$B$4=\"DK\",VLOOKUP($A43,'Style navne sprog'!$A:$I,6,FALSE),IF(Selection!$B$4=\"DE\",VLOOKUP($A43,'Style navne sprog'!$A:$I,2,FALSE),IF(Selection!$B$4=\"GB\",VLOOKUP($A43,'Style navne sprog'!$A:$I,4,FALSE),IF(Selection!$B$4=\"SE\",VLOOKUP($A43,'Style navne sprog'!$A:$I,3,FALSE),IF(Selection!$B$4=\"NO\",VLOOKUP($A43,'Style navne sprog'!$A:$I,5,FALSE),IF(Selection!$B$4=\"PL\",VLOOKUP($A43,'Style navne sprog'!$A:$I,7,FALSE)))))))","v":"Long-sleeved polo shirt | stretch"},{"$f":"IF(Master!C43<>\"\",Master!C43*Selection!$B$3,\"\")","v":55.300000000000004},{"$f":"IF(Master!D43<>\"\",Master!D43*Selection!$B$3,\"\")","v":52.6},"3XL-6XL",{"$f":"IF(Master!F43<>\"\",Master!F43*Selection!$B$3,\"\")","v":5.4},{"$f":"IF(Factor!#REF!<>\"\",Factor!#REF!*Selection!$B$3,\"\")","v":{"$error":"#REF!"}}]
["0545",{"$f":"IF(Selection!$B$4=\"DK\",VLOOKUP($A44,'Style navne sprog'!$A:$I,6,FALSE),IF(Selection!$B$4=\"DE\",VLOOKUP($A44,'Style navne sprog'!$A:$I,2,FALSE),IF(Selection!$B$4=\"GB\",VLOOKUP($A44,'Style navne sprog'!$A:$I,4,FALSE),IF(Selection!$B$4=\"SE\",VLOOKUP($A44,'Style navne sprog'!$A:$I,3,FALSE),IF(Selection!$B$4=\"NO\",VLOOKUP($A44,'Style navne sprog'!$A:$I,5,FALSE),IF(Selection!$B$4=\"PL\",VLOOKUP($A44,'Style navne sprog'!$A:$I,7,FALSE)))))))","v":"Long-sleeved polo shirt | stretch | women"},{"$f":"IF(Master!C44<>\"\",Master!C44*Selection!$B$3,\"\")","v":55.300000000000004},{"$f":"IF(Master!D44<>\"\",Master!D44*Selection!$B$3,\"\")","v":52.6},"3XL-6XL",{"$f":"IF(Master!F44<>\"\",Master!F44*Selection!$B$3,\"\")","v":5.4},{"$f":"IF(Factor!#REF!<>\"\",Factor!#REF!*Selection!$B$3,\"\")","v":{"$error":"#REF!"}}]
["0572",{"$f":"IF(Selection!$B$4=\"DK\",VLOOKUP($A45,'Style navne sprog'!$A:$I,6,FALSE),IF(Selection!$B$4=\"DE\",VLOOKUP($A45,'Style navne sprog'!$A:$I,2,FALSE),IF(Selection!$B$4=\"GB\",VLOOKUP($A45,'Style navne sprog'!$A:$I,4,FALSE),IF(Selection!$B$4=\"SE\",VLOOKUP($A45,'Style navne sprog'!$A:$I,3,FALSE),IF(Selection!$B$4=\"NO\",VLOOKUP($A45,'Style navne sprog'!$A:$I,5,FALSE),IF(Selection!$B$4=\"PL\",VLOOKUP($A45,'Style navne sprog'!$A:$I,7,FALSE)))))))","v":"Polo shirt I active"},{"$f":"IF(Master!C45<>\"\",Master!C45*Selection!$B$3,\"\")","v":66.8},{"$f":"IF(Master!D45<>\"\",Master!D45*Selection!$B$3,\"\")","v":""},"3XL-4XL",{"$f":"IF(Master!F45<>\"\",Master!F45*Selection!$B$3,\"\")","v":5.4},{"$f":"IF(Factor!#REF!<>\"\",Factor!#REF!*Selection!$B$3,\"\")","v":{"$error":"#REF!"}}]
["0573",{"$f":"IF(Selection!$B$4=\"DK\",VLOOKUP($A46,'Style navne sprog'!$A:$I,6,FALSE),IF(Selection!$B$4=\"DE\",VLOOKUP($A46,'Style navne sprog'!$A:$I,2,FALSE),IF(Selection!$B$4=\"GB\",VLOOKUP($A46,'Style navne sprog'!$A:$I,4,FALSE),IF(Selection!$B$4=\"SE\",VLOOKUP($A46,'Style navne sprog'!$A:$I,3,FALSE),IF(Selection!$B$4=\"NO\",VLOOKUP($A46,'Style navne sprog'!$A:$I,5,FALSE),IF(Selection!$B$4=\"PL\",VLOOKUP($A46,'Style navne sprog'!$A:$I,7,FALSE)))))))","v":"Polo shirt | active | women"},{"$f":"IF(Master!C46<>\"\",Master!C46*Selection!$B$3,\"\")","v":66.8},{"$f":"IF(Master!D46<>\"\",Master!D46*Selection!$B$3,\"\")","v":""},"3XL-4XL",{"$f":"IF(Master!F46<>\"\",Master!F46*Selection!$B$3,\"\")","v":5.4},{"$f":"IF(Factor!#REF!<>\"\",Factor!#REF!*Selection!$B$3,\"\")","v":{"$error":"#REF!"}}]
["0586",{"$f":"IF(Selection!$B$4=\"DK\",VLOOKUP($A47,'Style navne sprog'!$A:$I,6,FALSE),IF(Selection!$B$4=\"DE\",VLOOKUP($A47,'Style navne sprog'!$A:$I,2,FALSE),IF(Selection!$B$4=\"GB\",VLOOKUP($A47,'Style navne sprog'!$A:$I,4,FALSE),IF(Selection!$B$4=\"SE\",VLOOKUP($A47,'Style navne sprog'!$A:$I,3,FALSE),IF(Selection!$B$4=\"NO\",VLOOKUP($A47,'Style navne sprog'!$A:$I,5,FALSE),IF(Selection!$B$4=\"PL\",VLOOKUP($A47,'Style navne sprog'!$A:$I,7,FALSE)))))))","v":"Polo shirt | organic"},{"$f":"IF(Master!C47<>\"\",Master!C47*Selection!$B$3,\"\")","v":59.900000000000006},{"$f":"IF(Master!D47<>\"\",Master!D47*Selection!$B$3,\"\")","v":57.2},"3XL-4XL",{"$f":"IF(Master!F47<>\"\",Master!F47*Selection!$B$3,\"\")","v":5.4},{"$f":"IF(Factor!#REF!<>\"\",Factor!#REF!*Selection!$B$3,\"\")","v":{"$error":"#REF!"}}]
["0587",{"$f":"IF(Selection!$B$4=\"DK\",VLOOKUP($A48,'Style navne sprog'!$A:$I,6,FALSE),IF(Selection!$B$4=\"DE\",VLOOKUP($A48,'Style navne sprog'!$A:$I,2,FALSE),IF(Selection!$B$4=\"GB\",VLOOKUP($A48,'Style navne sprog'!$A:$I,4,FALSE),IF(Selection!$B$4=\"SE\",VLOOKUP($A48,'Style navne sprog'!$A:$I,3,FALSE),IF(Selection!$B$4=\"NO\",VLOOKUP($A48,'Style navne sprog'!$A:$I,5,FALSE),IF(Selection!$B$4=\"PL\",VLOOKUP($A48,'Style navne sprog'!$A:$I,7,FALSE)))))))","v":"Polo shirt | organic | women"},{"$f":"IF(Master!C48<>\"\",Master!C48*Selection!$B$3,\"\")","v":59.900000000000006},{"$f":"IF(Master!D48<>\"\",Master!D48*Selection!$B$3,\"\")","v":57.2},"3XL",{"$f":"IF(Master!F48<>\"\",Master!F48*Selection!$B$3,\"\")","v":5.4},{"$f":"IF(Factor!#REF!<>\"\",Factor!#REF!*Selection!$B$3,\"\")","v":{"$error":"#REF!"}}]
["2020",{"$f":"IF(Selection!$B$4=\"DK\",VLOOKUP($A49,'Style navne sprog'!$A:$I,6,FALSE),IF(Selection!$B$4=\"DE\",VLOOKUP($A49,'Style navne sprog'!$A:$I,2,FALSE),IF(Selection!$B$4=\"GB\",VLOOKUP($A49,'Style navne sprog'!$A:$I,4,FALSE),IF(Selection!$B$4=\"SE\",VLOOKUP($A49,'Style navne sprog'!$A:$I,3,FALSE),IF(Selection!$B$4=\"NO\",VLOOKUP($A49,'Style navne sprog'!$A:$I,5,FALSE),IF(Selection!$B$4=\"PL\",VLOOKUP($A49,'Style navne sprog'!$A:$I,7,FALSE)))))))","v":"YES polo shirt"},{"$f":"IF(Master!C49<>\"\",Master!C49*Selection!$B$3,\"\")","v":32.300000000000004},{"$f":"IF(Master!D49<>\"\",Master!D49*Selection!$B$3,\"\")","v":""},"3XL",{"$f":"IF(Master!F49<>\"\",Master!F49*Selection!$B$3,\"\")","v":5.4},{"$f":"IF(Factor!#REF!<>\"\",Factor!#REF!*Selection!$B$3,\"\")","v":{"$error":"#REF!"}}]
[]
[{"$f":"IF(Selection!$B$4=\"PL\",\"BLUZY\",\"SWEAT\")","v":"SWEAT"}]
["0600",{"$f":"IF(Selection!$B$4=\"DK\",VLOOKUP($A52,'Style navne sprog'!$A:$I,6,FALSE),IF(Selection!$B$4=\"DE\",VLOOKUP($A52,'Style navne sprog'!$A:$I,2,FALSE),IF(Selection!$B$4=\"GB\",VLOOKUP($A52,'Style navne sprog'!$A:$I,4,FALSE),IF(Selection!$B$4=\"SE\",VLOOKUP($A52,'Style navne sprog'!$A:$I,3,FALSE),IF(Selection!$B$4=\"NO\",VLOOKUP($A52,'Style navne sprog'!$A:$I,5,FALSE),IF(Selection!$B$4=\"PL\",VLOOKUP($A52,'Style navne sprog'!$A:$I,7,FALSE)))))))","v":"Sweatshirt | classic"},{"$f":"IF(Master!C52<>\"\",Master!C52*Selection!$B$3,\"\")","v":57.300000000000004},{"$f":"IF(Master!D52<>\"\",Master!D52*Selection!$B$3,\"\")","v":54.6},"3XL-6XL",{"$f":"IF(Master!F52<>\"\",Master!F52*Selection!$B$3,\"\")","v":5.4},{"$f":"IF(Factor!#REF!<>\"\",Factor!#REF!*Selection!$B$3,\"\")","v":{"$error":"#REF!"}}]
["0601",{"$f":"IF(Selection!$B$4=\"DK\",VLOOKUP($A53,'Style navne sprog'!$A:$I,6,FALSE),IF(Selection!$B$4=\"DE\",VLOOKUP($A53,'Style navne sprog'!$A:$I,2,FALSE),IF(Selection!$B$4=\"GB\",VLOOKUP($A53,'Style navne sprog'!$A:$I,4,FALSE),IF(Selection!$B$4=\"SE\",VLOOKUP($A53,'Style navne sprog'!$A:$I,3,FALSE),IF(Selection!$B$4=\"NO\",VLOOKUP($A53,'Style navne sprog'!$A:$I,5,FALSE),IF(Selection!$B$4=\"PL\",VLOOKUP($A53,'Style navne sprog'!$A:$I,7,FALSE)))))))","v":"Polo sweatshirt | classic"},{"$f":"IF(Master!C53<>\"\",Master!C53*Selection!$B$3,\"\")","v":67.7},{"$f":"IF(Master!D53<>\"\",Master!D53*Selection!$B$3,\"\")","v":""},"3XL-4XL",{"$f":"IF(Master!F53<>\"\",Master!F53*Selection!$B$3,\"\")","v":5.4},{"$f":"IF(Factor!#REF!<>\"\",Factor!#REF!*Selection!$B$3,\"\")","v":{"$error":"#REF!"}}]
["0603",{"$f":"IF(Selection!$B$4=\"DK\",VLOOKUP($A54,'Style navne sprog'!$A:$I,6,FALSE),IF(Selection!$B$4=\"DE\",VLOOKUP($A54,'Style navne sprog'!$A:$I,2,FALSE),IF(Selection!$B$4=\"GB\",VLOOKUP($A54,'Style navne sprog'!$A:$I,4,FALSE),IF(Selection!$B$4=\"SE\",VLOOKUP($A54,'Style navne sprog'!$A:$I,3,FALSE),IF(Selection!$B$4=\"NO\",VLOOKUP($A54,'Style navne sprog'!$A:$I,5,FALSE),IF(Selection!$B$4=\"PL\",VLOOKUP($A54,'Style navne sprog'!$A:$I,7,FALSE)))))))","v":"Sweatshirt | zip"},{"$f":"IF(Master!C54<>\"\",Master!C54*Selection!$B$3,\"\")","v":88.5},{"$f":"IF(Master!D54<>\"\",Master!D54*Selection!$B$3,\"\")","v":""},"3XL",{"$f":"IF(Master!F54<>\"\",Master!F54*Selection!$B$3,\"\")","v":5.4},{"$f":"IF(Factor!#REF!<>\"\",Factor!#REF!*Selection!$B$3,\"\")","v":{"$error":"#REF!"}}]
["0604",{"$f":"IF(Selection!$B$4=\"DK\",VLOOKUP($A55,'Style navne sprog'!$A:$I,6,FALSE),IF(Selection!$B$4=\"DE\",VLOOKUP($A55,'Style navne sprog'!$A:$I,2,FALSE),IF(Selection!$B$4=\"GB\",VLOOKUP($A55,'Style navne sprog'!$A:$I,4,FALSE),IF(Selection!$B$4=\"SE\",VLOOKUP($A55,'Style navne sprog'!$A:$I,3,FALSE),IF(Selection!$B$4=\"NO\",VLOOKUP($A55,'Style navne sprog'!$A:$I,5,FALSE),IF(Selection!$B$4=\"PL\",VLOOKUP($A55,'Style navne sprog'!$A:$I,7,FALSE)))))))","v":"Classic sweatshirt | cotton"},{"$f":"IF(Master!C55<>\"\",Master!C55*Selection!$B$3,\"\")","v":59.7},{"$f":"IF(Master!D55<>\"\",Master!D55*Selection!$B$3,\"\")","v":""},"3XL-4XL",{"$f":"IF(Master!F55<>\"\",Master!F55*Selection!$B$3,\"\")","v":5.4},{"$f":"IF(Factor!#REF!<>\"\",Factor!#REF!*Selection!$B$3,\"\")","v":{"$error":"#REF!"}}]
["0613",{"$f":"IF(Selection!$B$4=\"DK\",VLOOKUP($A56,'Style navne sprog'!$A:$I,6,FALSE),IF(Selection!$B$4=\"DE\",VLOOKUP($A56,'Style navne sprog'!$A:$I,2,FALSE),IF(Selection!$B$4=\"GB\",VLOOKUP($A56,'Style navne sprog'!$A:$I,4,FALSE),IF(Selection!$B$4=\"SE\",VLOOKUP($A56,'Style navne sprog'!$A:$I,3,FALSE),IF(Selection!$B$4=\"NO\",VLOOKUP($A56,'Style navne sprog'!$A:$I,5,FALSE),IF(Selection!$B$4=\"PL\",VLOOKUP($A56,'Style navne sprog'!$A:$I,7,FALSE)))))))","v":"Sweatshirt | business"},{"$f":"IF(Master!C56<>\"\",Master!C56*Selection!$B$3,\"\")","v":85.600000000000009},{"$f":"IF(Master!D56<>\"\",Master!D56*Selection!$B$3,\"\")","v":""},"3XL",{"$f":"IF(Master!F56<>\"\",Master!F56*Selection!$B$3,\"\")","v":5.4},{"$f":"IF(Factor!#REF!<>\"\",Factor!#REF!*Selection!$B$3,\"\")","v":{"$error":"#REF!"}}]
["0622",{"$f":"IF(Selection!$B$4=\"DK\",VLOOKUP($A57,'Style navne sprog'!$A:$I,6,FALSE),IF(Selection!$B$4=\"DE\",VLOOKUP($A57,'Style navne sprog'!$A:$I,2,FALSE),IF(Selection!$B$4=\"GB\",VLOOKUP($A57,'Style navne sprog'!$A:$I,4,FALSE),IF(Selection!$B$4=\"SE\",VLOOKUP($A57,'Style navne sprog'!$A:$I,3,FALSE),IF(Selection!$B$4=\"NO\",VLOOKUP($A57,'Style navne sprog'!$A:$I,5,FALSE),IF(Selection!$B$4=\"PL\",VLOOKUP($A57,'Style navne sprog'!$A:$I,7,FALSE)))))))","v":"Sweat cardigan"},{"$f":"IF(Master!C57<>\"\",Master!C57*Selection!$B$3,\"\")","v":97.2},{"$f":"IF(Master!D57<>\"\",Master!D57*Selection!$B$3,\"\")","v":""},"3XL",{"$f":"IF(Master!F57<>\"\",Master!F57*Selection!$B$3,\"\")","v":5.4},{"$f":"IF(Factor!#REF!<>\"\",Factor!#REF!*Selection!$B$3,\"\")","v":{"$error":"#REF!"}}]
["0624",{"$f":"IF(Selection!$B$4=\"DK\",VLOOKUP($A58,'Style navne sprog'!$A:$I,6,FALSE),IF(Selection!$B$4=\"DE\",VLOOKUP($A58,'Style navne sprog'!$A:$I,2,FALSE),IF(Selection!$B$4=\"GB\",VLOOKUP($A58,'Style navne sprog'!$A:$I,4,FALSE),IF(Selection!$B$4=\"SE\",VLOOKUP($A58,'Style navne sprog'!$A:$I,3,FALSE),IF(Selection!$B$4=\"NO\",VLOOKUP($A58,'Style navne sprog'!$A:$I,5,FALSE),IF(Selection!$B$4=\"PL\",VLOOKUP($A58,'Style navne sprog'!$A:$I,7,FALSE)))))))","v":"Sweat cardigan | women"},{"$f":"IF(Master!C58<>\"\",Master!C58*Selection!$B$3,\"\")","v":97.2},{"$f":"IF(Master!D58<>\"\",Master!D58*Selection!$B$3,\"\")","v":""},"3XL",{"$f":"IF(Master!F58<>\"\",Master!F58*Selection!$B$3,\"\")","v":5.4},{"$f":"IF(Factor!#REF!<>\"\",Factor!#REF!*Selection!$B$3,\"\")","v":{"$error":"#REF!"}}]
["0626",{"$f":"IF(Selection!$B$4=\"DK\",VLOOKUP($A59,'Style navne sprog'!$A:$I,6,FALSE),IF(Selection!$B$4=\"DE\",VLOOKUP($A59,'Style navne sprog'!$A:$I,2,FALSE),IF(Selection!$B$4=\"GB\",VLOOKUP($A59,'Style navne sprog'!$A:$I,4,FALSE),IF(Selection!$B$4=\"SE\",VLOOKUP($A59,'Style navne sprog'!$A:$I,3,FALSE),IF(Selection!$B$4=\"NO\",VLOOKUP($A59,'Style navne sprog'!$A:$I,5,FALSE),IF(Selection!$B$4=\"PL\",VLOOKUP($A59,'Style navne sprog'!$A:$I,7,FALSE)))))))","v":"Sweat cardigan | contrast"},{"$f":"IF(Master!C59<>\"\",Master!C59*Selection!$B$3,\"\")","v":120.5},{"$f":"IF(Master!D59<>\"\",Master!D59*Selection!$B$3,\"\")","v":""},"3XL",{"$f":"IF(Master!F59<>\"\",Master!F59*Selection!$B$3,\"\")","v":5.4},{"$f":"IF(Factor!#REF!<>\"\",Factor!#REF!*Selection!$B$3,\"\")","v":{"$error":"#REF!"}}]
["0627",{"$f":"IF(Selection!$B$4=\"DK\",VLOOKUP($A60,'Style navne sprog'!$A:$I,6,FALSE),IF(Selection!$B$4=\"DE\",VLOOKUP($A60,'Style navne sprog'!$A:$I,2,FALSE),IF(Selection!$B$4=\"GB\",VLOOKUP($A60,'Style navne sprog'!$A:$I,4,FALSE),IF(Selection!$B$4=\"SE\",VLOOKUP($A60,'Style navne sprog'!$A:$I,3,FALSE),IF(Selection!$B$4=\"NO\",VLOOKUP($A60,'Style navne sprog'!$A:$I,5,FALSE),IF(Selection!$B$4=\"PL\",VLOOKUP($A60,'Style navne sprog'!$A:$I,7,FALSE)))))))","v":"Sweat cardigan | contrast | women"},{"$f":"IF(Master!C60<>\"\",Master!C60*Selection!$B$3,\"\")","v":120.5},{"$f":"IF(Master!D60<>\"\",Master!D60*Selection!$B$3,\"\")","v":""},"3XL",{"$f":"IF(Master!F60<>\"\",Master!F60*Selection!$B$3,\"\")","v":5.4},{"$f":"IF(Factor!#REF!<>\"\",Factor!#REF!*Selection!$B$3,\"\")","v":{"$error":"#REF!"}}]
["0628",{"$f":"IF(Selection!$B$4=\"DK\",VLOOKUP($A61,'Style navne sprog'!$A:$I,6,FALSE),IF(Selection!$B$4=\"DE\",VLOOKUP($A61,'Style navne sprog'!$A:$I,2,FALSE),IF(Selection!$B$4=\"GB\",VLOOKUP($A61,'Style navne sprog'!$A:$I,4,FALSE),IF(Selection!$B$4=\"SE\",VLOOKUP($A61,'Style navne sprog'!$A:$I,3,FALSE),IF(Selection!$B$4=\"NO\",VLOOKUP($A61,'Style navne sprog'!$A:$I,5,FALSE),IF(Selection!$B$4=\"PL\",VLOOKUP($A61,'Style navne sprog'!$A:$I,7,FALSE)))))))","v":"Sweat cardigan | zip"},{"$f":"IF(Master!C61<>\"\",Master!C61*Selection!$B$3,\"\")","v":98.9},{"$f":"IF(Master!D61<>\"\",Master!D61*Selection!$B$3,\"\")","v":""},"3XL-4XL",{"$f":"IF(Master!F61<>\"\",Master!F61*Selection!$B$3,\"\")","v":5.4},{"$f":"IF(Factor!#REF!<>\"\",Factor!#REF!*Selection!$B$3,\"\")","v":{"$error":"#REF!"}}]
["0629",{"$f":"IF(Selection!$B$4=\"DK\",VLOOKUP($A62,'Style navne sprog'!$A:$I,6,FALSE),IF(Selection!$B$4=\"DE\",VLOOKUP($A62,'Style navne sprog'!$A:$I,2,FALSE),IF(Selection!$B$4=\"GB\",VLOOKUP($A62,'Style navne sprog'!$A:$I,4,FALSE),IF(Selection!$B$4=\"SE\",VLOOKUP($A62,'Style navne sprog'!$A:$I,3,FALSE),IF(Selection!$B$4=\"NO\",VLOOKUP($A62,'Style navne sprog'!$A:$I,5,FALSE),IF(Selection!$B$4=\"PL\",VLOOKUP($A62,'Style navne sprog'!$A:$I,7,FALSE)))))))","v":"Sweat cardigan | zip | women"},{"$f":"IF(Master!C62<>\"\",Master!C62*Selection!$B$3,\"\")","v":98.9},{"$f":"IF(Master!D62<>\"\",Master!D62*Selection!$B$3,\"\")","v":""},"3XL-4XL",{"$f":"IF(Master!F62<>\"\",Master!F62*Selection!$B$3,\"\")","v":5.4},{"$f":"IF(Factor!#REF!<>\"\",Factor!#REF!*Selection!$B$3,\"\")","v":{"$error":"#REF!"}}]
["0630",{"$f":"IF(Selection!$B$4=\"DK\",VLOOKUP($A63,'Style navne sprog'!$A:$I,6,FALSE),IF(Selection!$B$4=\"DE\",VLOOKUP($A63,'Style navne sprog'!$A:$I,2,FALSE),IF(Selection!$B$4=\"GB\",VLOOKUP($A63,'Style navne sprog'!$A:$I,4,FALSE),IF(Selection!$B$4=\"SE\",VLOOKUP($A63,'Style navne sprog'!$A:$I,3,FALSE),IF(Selection!$B$4=\"NO\",VLOOKUP($A63,'Style navne sprog'!$A:$I,5,FALSE),IF(Selection!$B$4=\"PL\",VLOOKUP($A63,'Style navne sprog'!$A:$I,7,FALSE)))))))","v":"Sweat cardigan | bonded"},{"$f":"IF(Master!C63<>\"\",Master!C63*Selection!$B$3,\"\")","v":161.10000000000002},{"$f":"IF(Master!D63<>\"\",Master!D63*Selection!$B$3,\"\")","v":""},"3XL",{"$f":"IF(Master!F63<>\"\",Master!F63*Selection!$B$3,\"\")","v":5.4},{"$f":"IF(Factor!#REF!<>\"\",Factor!#REF!*Selection!$B$3,\"\")","v":{"$error":"#REF!"}}]
["0636",{"$f":"IF(Selection!$B$4=\"DK\",VLOOKUP($A64,'Style navne sprog'!$A:$I,6,FALSE),IF(Selection!$B$4=\"DE\",VLOOKUP($A64,'Style navne sprog'!$A:$I,2,FALSE),IF(Selection!$B$4=\"GB\",VLOOKUP($A64,'Style navne sprog'!$A:$I,4,FALSE),IF(Selection!$B$4=\"SE\",VLOOKUP($A64,'Style navne sprog'!$A:$I,3,FALSE),IF(Selection!$B$4=\"NO\",VLOOKUP($A64,'Style navne sprog'!$A:$I,5,FALSE),IF(Selection!$B$4=\"PL\",VLOOKUP($A64,'Style navne sprog'!$A:$I,7,FALSE)))))))","v":"CORE hoodie"},{"$f":"IF(Master!C64<>\"\",Master!C64*Selection!$B$3,\"\")","v":70.900000000000006},{"$f":"IF(Master!D64<>\"\",Master!D64*Selection!$B$3,\"\")","v":""},"3XL-6XL",{"$f":"IF(Master!F64<>\"\",Master!F64*Selection!$B$3,\"\")","v":5.4},{"$f":"IF(Factor!#REF!<>\"\",Factor!#REF!*Selection!$B$3,\"\")","v":{"$error":"#REF!"}}]
["0637",{"$f":"IF(Selection!$B$4=\"DK\",VLOOKUP($A65,'Style navne sprog'!$A:$I,6,FALSE),IF(Selection!$B$4=\"DE\",VLOOKUP($A65,'Style navne sprog'!$A:$I,2,FALSE),IF(Selection!$B$4=\"GB\",VLOOKUP($A65,'Style navne sprog'!$A:$I,4,FALSE),IF(Selection!$B$4=\"SE\",VLOOKUP($A65,'Style navne sprog'!$A:$I,3,FALSE),IF(Selection!$B$4=\"NO\",VLOOKUP($A65,'Style navne sprog'!$A:$I,5,FALSE),IF(Selection!$B$4=\"PL\",VLOOKUP($A65,'Style navne sprog'!$A:$I,7,FALSE)))))))","v":"CORE hoodie | women"},{"$f":"IF(Master!C65<>\"\",Master!C65*Selection!$B$3,\"\")","v":70.900000000000006},{"$f":"IF(Master!D65<>\"\",Master!D65*Selection!$B$3,\"\")","v":""},"3XL",{"$f":"IF(Master!F65<>\"\",Master!F65*Selection!$B$3,\"\")","v":5.4},{"$f":"IF(Factor!#REF!<>\"\",Factor!#REF!*Selection!$B$3,\"\")","v":{"$error":"#REF!"}}]
["0638",{"$f":"IF(Selection!$B$4=\"DK\",VLOOKUP($A66,'Style navne sprog'!$A:$I,6,FALSE),IF(Selection!$B$4=\"DE\",VLOOKUP($A66,'Style navne sprog'!$A:$I,2,FALSE),IF(Selection!$B$4=\"GB\",VLOOKUP($A66,'Style navne sprog'!$A:$I,4,FALSE),IF(Selection!$B$4=\"SE\",VLOOKUP($A66,'Style navne sprog'!$A:$I,3,FALSE),IF(Selection!$B$4=\"NO\",VLOOKUP($A66,'Style navne sprog'!$A:$I,5,FALSE),IF(Selection!$B$4=\"PL\",VLOOKUP($A66,'Style navne sprog'!$A:$I,7,FALSE)))))))","v":"CORE hoodie | zip"},{"$f":"IF(Master!C66<>\"\",Master!C66*Selection!$B$3,\"\")","v":88.5},{"$f":"IF(Master!D66<>\"\",Master!D66*Selection!$B$3,\"\")","v":""},"3XL-6XL",{"$f":"IF(Master!F66<>\"\",Master!F66*Selection!$B$3,\"\")","v":5.4},{"$f":"IF(Factor!#REF!<>\"\",Factor!#REF!*Selection!$B$3,\"\")","v":{"$error":"#REF!"}}]
["0639",{"$f":"IF(Selection!$B$4=\"DK\",VLOOKUP($A67,'Style navne sprog'!$A:$I,6,FALSE),IF(Selection!$B$4=\"DE\",VLOOKUP($A67,'Style navne sprog'!$A:$I,2,FALSE),IF(Selection!$B$4=\"GB\",VLOOKUP($A67,'Style navne sprog'!$A:$I,4,FALSE),IF(Selection!$B$4=\"SE\",VLOOKUP($A67,'Style navne sprog'!$A:$I,3,FALSE),IF(Selection!$B$4=\"NO\",VLOOKUP($A67,'Style navne sprog'!$A:$I,5,FALSE),IF(Selection!$B$4=\"PL\",VLOOKUP($A67,'Style navne sprog'!$A:$I,7,FALSE)))))))","v":"CORE hoodie | zip | women"},{"$f":"IF(Master!C67<>\"\",Master!C67*Selection!$B$3,\"\")","v":88.5},{"$f":"IF(Master!D67<>\"\",Master!D67*Selection!$B$3,\"\")","v":""},"3XL",{"$f":"IF(Master!F67<>\"\",Master!F67*Selection!$B$3,\"\")","v":5.4},{"$f":"IF(Factor!#REF!<>\"\",Factor!#REF!*Selection!$B$3,\"\")","v":{"$error":"#REF!"}}]
["0660",{"$f":"IF(Selection!$B$4=\"DK\",VLOOKUP($A68,'Style navne sprog'!$A:$I,6,FALSE),IF(Selection!$B$4=\"DE\",VLOOKUP($A68,'Style navne sprog'!$A:$I,2,FALSE),IF(Selection!$B$4=\"GB\",VLOOKUP($A68,'Style navne sprog'!$A:$I,4,FALSE),IF(Selection!$B$4=\"SE\",VLOOKUP($A68,'Style navne sprog'!$A:$I,3,FALSE),IF(Selection!$B$4=\"NO\",VLOOKUP($A68,'Style navne sprog'!$A:$I,5,FALSE),IF(Selection!$B$4=\"PL\",VLOOKUP($A68,'Style navne sprog'!$A:$I,7,FALSE)))))))","v":"Soft hoodie | kangaroo pocket | unisex"},{"$f":"IF(Master!C68<>\"\",Master!C68*Selection!$B$3,\"\")","v":53.400000000000006},{"$f":"IF(Master!D68<>\"\",Master!D68*Selection!$B$3,\"\")","v":""},"3XL-4XL",{"$f":"IF(Master!F68<>\"\",Master!F68*Selection!$B$3,\"\")","v":5.4},{"$f":"IF(Factor!#REF!<>\"\",Factor!#REF!*Selection!$B$3,\"\")","v":{"$error":"#REF!"}}]
["0682",{"$f":"IF(Selection!$B$4=\"DK\",VLOOKUP($A69,'Style navne sprog'!$A:$I,6,FALSE),IF(Selection!$B$4=\"DE\",VLOOKUP($A69,'Style navne sprog'!$A:$I,2,FALSE),IF(Selection!$B$4=\"GB\",VLOOKUP($A69,'Style navne sprog'!$A:$I,4,FALSE),IF(Selection!$B$4=\"SE\",VLOOKUP($A69,'Style navne sprog'!$A:$I,3,FALSE),IF(Selection!$B$4=\"NO\",VLOOKUP($A69,'Style navne sprog'!$A:$I,5,FALSE),IF(Selection!$B$4=\"PL\",VLOOKUP($A69,'Style navne sprog'!$A:$I,7,FALSE)))))))","v":"Sweatshirt | organic"},{"$f":"IF(Master!C69<>\"\",Master!C69*Selection!$B$3,\"\")","v":68.100000000000009},{"$f":"IF(Master!D69<>\"\",Master!D69*Selection!$B$3,\"\")","v":""},"3XL-4XL",{"$f":"IF(Master!F69<>\"\",Master!F69*Selection!$B$3,\"\")","v":5.4},{"$f":"IF(Factor!#REF!<>\"\",Factor!#REF!*Selection!$B$3,\"\")","v":{"$error":"#REF!"}}]
["0683",{"$f":"IF(Selection!$B$4=\"DK\",VLOOKUP($A70,'Style navne sprog'!$A:$I,6,FALSE),IF(Selection!$B$4=\"DE\",VLOOKUP($A70,'Style navne sprog'!$A:$I,2,FALSE),IF(Selection!$B$4=\"GB\",VLOOKUP($A70,'Style navne sprog'!$A:$I,4,FALSE),IF(Selection!$B$4=\"SE\",VLOOKUP($A70,'Style navne sprog'!$A:$I,3,FALSE),IF(Selection!$B$4=\"NO\",VLOOKUP($A70,'Style navne sprog'!$A:$I,5,FALSE),IF(Selection!$B$4=\"PL\",VLOOKUP($A70,'Style navne sprog'!$A:$I,7,FALSE)))))))","v":"Sweatshirt | organic | women"},{"$f":"IF(Master!C70<>\"\",Master!C70*Selection!$B$3,\"\")","v":68.100000000000009},{"$f":"IF(Master!D70<>\"\",Master!D70*Selection!$B$3,\"\")","v":""},"3XL",{"$f":"IF(Master!F70<>\"\",Master!F70*Selection!$B$3,\"\")","v":5.4},{"$f":"IF(Factor!#REF!<>\"\",Factor!#REF!*Selection!$B$3,\"\")","v":{"$error":"#REF!"}}]
[]
["PRO WEAR"]
["0300",{"$f":"IF(Selection!$B$4=\"DK\",VLOOKUP($A73,'Style navne sprog'!$A:$I,6,FALSE),IF(Selection!$B$4=\"DE\",VLOOKUP($A73,'Style navne sprog'!$A:$I,2,FALSE),IF(Selection!$B$4=\"GB\",VLOOKUP($A73,'Style navne sprog'!$A:$I,4,FALSE),IF(Selection!$B$4=\"SE\",VLOOKUP($A73,'Style navne sprog'!$A:$I,3,FALSE),IF(Selection!$B$4=\"NO\",VLOOKUP($A73,'Style navne sprog'!$A:$I,5,FALSE),IF(Selection!$B$4=\"PL\",VLOOKUP($A73,'Style navne sprog'!$A:$I,7,FALSE)))))))","v":"PRO Wear T-shirt"},{"$f":"IF(Master!C73<>\"\",Master!C73*Selection!$B$3,\"\")","v":28.6},{"$f":"IF(Master!D73<>\"\",Master!D73*Selection!$B$3,\"\")","v":27},"3XL-6XL",{"$f":"IF(Master!F73<>\"\",Master!F73*Selection!$B$3,\"\")","v":2.8000000000000003},{"$f":"IF(Factor!#REF!<>\"\",Factor!#REF!*Selection!$B$3,\"\")","v":{"$error":"#REF!"}}]
["0302",{"$f":"IF(Selection!$B$4=\"DK\",VLOOKUP($A74,'Style navne sprog'!$A:$I,6,FALSE),IF(Selection!$B$4=\"DE\",VLOOKUP($A74,'Style navne sprog'!$A:$I,2,FALSE),IF(Selection!$B$4=\"GB\",VLOOKUP($A74,'Style navne sprog'!$A:$I,4,FALSE),IF(Selection!$B$4=\"SE\",VLOOKUP($A74,'Style navne sprog'!$A:$I,3,FALSE),IF(Selection!$B$4=\"NO\",VLOOKUP($A74,'Style navne sprog'!$A:$I,5,FALSE),IF(Selection!$B$4=\"PL\",VLOOKUP($A74,'Style navne sprog'!$A:$I,7,FALSE)))))))","v":"PRO Wear T-shirt | contrast"},{"$f":"IF(Master!C74<>\"\",Master!C74*Selection!$B$3,\"\")","v":34.4},{"$f":"IF(Master!D74<>\"\",Master!D74*Selection!$B$3,\"\")","v":32.800000000000004},"3XL-6XL",{"$f":"IF(Master!F74<>\"\",Master!F74*Selection!$B$3,\"\")","v":2.8000000000000003},{"$f":"IF(Factor!#REF!<>\"\",Factor!#REF!*Selection!$B$3,\"\")","v":{"$error":"#REF!"}}]
["0310",{"$f":"IF(Selection!$B$4=\"DK\",VLOOKUP($A75,'Style navne sprog'!$A:$I,6,FALSE),IF(Selection!$B$4=\"DE\",VLOOKUP($A75,'Style navne sprog'!$A:$I,2,FALSE),IF(Selection!$B$4=\"GB\",VLOOKUP($A75,'Style navne sprog'!$A:$I,4,FALSE),IF(Selection!$B$4=\"SE\",VLOOKUP($A75,'Style navne sprog'!$A:$I,3,FALSE),IF(Selection!$B$4=\"NO\",VLOOKUP($A75,'Style navne sprog'!$A:$I,5,FALSE),IF(Selection!$B$4=\"PL\",VLOOKUP($A75,'Style navne sprog'!$A:$I,7,FALSE)))))))","v":"PRO Wear T-shirt | light"},{"$f":"IF(Master!C75<>\"\",Master!C75*Selection!$B$3,\"\")","v":26.3},{"$f":"IF(Master!D75<>\"\",Master!D75*Selection!$B$3,\"\")","v":24.700000000000003},"3XL-6XL",{"$f":"IF(Master!F75<>\"\",Master!F75*Selection!$B$3,\"\")","v":2.8000000000000003},{"$f":"IF(Factor!#REF!<>\"\",Factor!#REF!*Selection!$B$3,\"\")","v":{"$error":"#REF!"}}]
["0311",{"$f":"IF(Selection!$B$4=\"DK\",VLOOKUP($A76,'Style navne sprog'!$A:$I,6,FALSE),IF(Selection!$B$4=\"DE\",VLOOKUP($A76,'Style navne sprog'!$A:$I,2,FALSE),IF(Selection!$B$4=\"GB\",VLOOKUP($A76,'Style navne sprog'!$A:$I,4,FALSE),IF(Selection!$B$4=\"SE\",VLOOKUP($A76,'Style navne sprog'!$A:$I,3,FALSE),IF(Selection!$B$4=\"NO\",VLOOKUP($A76,'Style navne sprog'!$A:$I,5,FALSE),IF(Selection!$B$4=\"PL\",VLOOKUP($A76,'Style navne sprog'!$A:$I,7,FALSE)))))))","v":"PRO Wear T-shirt | long-sleeved"},{"$f":"IF(Master!C76<>\"\",Master!C76*Selection!$B$3,\"\")","v":37},{"$f":"IF(Master!D76<>\"\",Master!D76*Selection!$B$3,\"\")","v":35.4},"3XL-6XL",{"$f":"IF(Master!F76<>\"\",Master!F76*Selection!$B$3,\"\")","v":2.8000000000000003},{"$f":"IF(Factor!#REF!<>\"\",Factor!#REF!*Selection!$B$3,\"\")","v":{"$error":"#REF!"}}]
["0312",{"$f":"IF(Selection!$B$4=\"DK\",VLOOKUP($A77,'Style navne sprog'!$A:$I,6,FALSE),IF(Selection!$B$4=\"DE\",VLOOKUP($A77,'Style navne sprog'!$A:$I,2,FALSE),IF(Selection!$B$4=\"GB\",VLOOKUP($A77,'Style navne sprog'!$A:$I,4,FALSE),IF(Selection!$B$4=\"SE\",VLOOKUP($A77,'Style navne sprog'!$A:$I,3,FALSE),IF(Selection!$B$4=\"NO\",VLOOKUP($A77,'Style navne sprog'!$A:$I,5,FALSE),IF(Selection!$B$4=\"PL\",VLOOKUP($A77,'Style navne sprog'!$A:$I,7,FALSE)))))))","v":"PRO Wear T-shirt | women"},{"$f":"IF(Master!C77<>\"\",Master!C77*Selection!$B$3,\"\")","v":28.6},{"$f":"IF(Master!D77<>\"\",Master!D77*Selection!$B$3,\"\")","v":27},"3XL-6XL",{"$f":"IF(Master!F77<>\"\",Master!F77*Selection!$B$3,\"\")","v":2.8000000000000003},{"$f":"IF(Factor!#REF!<>\"\",Factor!#REF!*Selection!$B$3,\"\")","v":{"$error":"#REF!"}}]
["0313",{"$f":"IF(Selection!$B$4=\"DK\",VLOOKUP($A78,'Style navne sprog'!$A:$I,6,FALSE),IF(Selection!$B$4=\"DE\",VLOOKUP($A78,'Style navne sprog'!$A:$I,2,FALSE),IF(Selection!$B$4=\"GB\",VLOOKUP($A78,'Style navne sprog'!$A:$I,4,FALSE),IF(Selection!$B$4=\"SE\",VLOOKUP($A78,'Style navne sprog'!$A:$I,3,FALSE),IF(Selection!$B$4=\"NO\",VLOOKUP($A78,'Style navne sprog'!$A:$I,5,FALSE),IF(Selection!$B$4=\"PL\",VLOOKUP($A78,'Style navne sprog'!$A:$I,7,FALSE)))))))","v":"PRO Wear T-shirt | ¾ sleeve | women"},{"$f":"IF(Master!C78<>\"\",Master!C78*Selection!$B$3,\"\")","v":31.900000000000002},{"$f":"IF(Master!D78<>\"\",Master!D78*Selection!$B$3,\"\")","v":30.3},"3XL-6XL",{"$f":"IF(Master!F78<>\"\",Master!F78*Selection!$B$3,\"\")","v":2.8000000000000003},{"$f":"IF(Factor!#REF!<>\"\",Factor!#REF!*Selection!$B$3,\"\")","v":{"$error":"#REF!"}}]
["0315",{"$f":"IF(Selection!$B$4=\"DK\",VLOOKUP($A79,'Style navne sprog'!$A:$I,6,FALSE),IF(Selection!$B$4=\"DE\",VLOOKUP($A79,'Style navne sprog'!$A:$I,2,FALSE),IF(Selection!$B$4=\"GB\",VLOOKUP($A79,'Style navne sprog'!$A:$I,4,FALSE),IF(Selection!$B$4=\"SE\",VLOOKUP($A79,'Style navne sprog'!$A:$I,3,FALSE),IF(Selection!$B$4=\"NO\",VLOOKUP($A79,'Style navne sprog'!$A:$I,5,FALSE),IF(Selection!$B$4=\"PL\",VLOOKUP($A79,'Style navne sprog'!$A:$I,7,FALSE)))))))","v":"PRO Wear T-shirt | ½ sleeve | women"},{"$f":"IF(Master!C79<>\"\",Master!C79*Selection!$B$3,\"\")","v":30.6},{"$f":"IF(Master!D79<>\"\",Master!D79*Selection!$B$3,\"\")","v":29},"3XL-6XL",{"$f":"IF(Master!F79<>\"\",Master!F79*Selection!$B$3,\"\")","v":2.8000000000000003},{"$f":"IF(Factor!#REF!<>\"\",Factor!#REF!*Selection!$B$3,\"\")","v":{"$error":"#REF!"}}]
["0317",{"$f":"IF(Selection!$B$4=\"DK\",VLOOKUP($A80,'Style navne sprog'!$A:$I,6,FALSE),IF(Selection!$B$4=\"DE\",VLOOKUP($A80,'Style navne sprog'!$A:$I,2,FALSE),IF(Selection!$B$4=\"GB\",VLOOKUP($A80,'Style navne sprog'!$A:$I,4,FALSE),IF(Selection!$B$4=\"SE\",VLOOKUP($A80,'Style navne sprog'!$A:$I,3,FALSE),IF(Selection!$B$4=\"NO\",VLOOKUP($A80,'Style navne sprog'!$A:$I,5,FALSE),IF(Selection!$B$4=\"PL\",VLOOKUP($A80,'Style navne sprog'!$A:$I,7,FALSE)))))))","v":"PRO Wear T-shirt | light | women"},{"$f":"IF(Master!C80<>\"\",Master!C80*Selection!$B$3,\"\")","v":26.3},{"$f":"IF(Master!D80<>\"\",Master!D80*Selection!$B$3,\"\")","v":24.700000000000003},"3XL-6XL",{"$f":"IF(Master!F80<>\"\",Master!F80*Selection!$B$3,\"\")","v":2.8000000000000003},{"$f":"IF(Factor!#REF!<>\"\",Factor!#REF!*Selection!$B$3,\"\")","v":{"$error":"#REF!"}}]
["0320",{"$f":"IF(Selection!$B$4=\"DK\",VLOOKUP($A81,'Style navne sprog'!$A:$I,6,FALSE),IF(Selection!$B$4=\"DE\",VLOOKUP($A81,'Style navne sprog'!$A:$I,2,FALSE),IF(Selection!$B$4=\"GB\",VLOOKUP($A81,'Style navne sprog'!$A:$I,4,FALSE),IF(Selection!$B$4=\"SE\",VLOOKUP($A81,'Style navne sprog'!$A:$I,3,FALSE),IF(Selection!$B$4=\"NO\",VLOOKUP($A81,'Style navne sprog'!$A:$I,5,FALSE),IF(Selection!$B$4=\"PL\",VLOOKUP($A81,'Style navne sprog'!$A:$I,7,FALSE)))))))","v":"PRO Wear polo shirt | pocket"},{"$f":"IF(Master!C81<>\"\",Master!C81*Selection!$B$3,\"\")","v":55.6},{"$f":"IF(Master!D81<>\"\",Master!D81*Selection!$B$3,\"\")","v":52.300000000000004},"3XL-6XL",{"$f":"IF(Master!F81<>\"\",Master!F81*Selection!$B$3,\"\")","v":5.4},{"$f":"IF(Factor!#REF!<>\"\",Factor!#REF!*Selection!$B$3,\"\")","v":{"$error":"#REF!"}}]
["0321",{"$f":"IF(Selection!$B$4=\"DK\",VLOOKUP($A82,'Style navne sprog'!$A:$I,6,FALSE),IF(Selection!$B$4=\"DE\",VLOOKUP($A82,'Style navne sprog'!$A:$I,2,FALSE),IF(Selection!$B$4=\"GB\",VLOOKUP($A82,'Style navne sprog'!$A:$I,4,FALSE),IF(Selection!$B$4=\"SE\",VLOOKUP($A82,'Style navne sprog'!$A:$I,3,FALSE),IF(Selection!$B$4=\"NO\",VLOOKUP($A82,'Style navne sprog'!$A:$I,5,FALSE),IF(Selection!$B$4=\"PL\",VLOOKUP($A82,'Style navne sprog'!$A:$I,7,FALSE)))))))","v":"PRO Wear polo shirt | women"},{"$f":"IF(Master!C82<>\"\",Master!C82*Selection!$B$3,\"\")","v":55.6},{"$f":"IF(Master!D82<>\"\",Master!D82*Selection!$B$3,\"\")","v":52.300000000000004},"3XL-6XL",{"$f":"IF(Master!F82<>\"\",Master!F82*Selection!$B$3,\"\")","v":5.4},{"$f":"IF(Factor!#REF!<>\"\",Factor!#REF!*Selection!$B$3,\"\")","v":{"$error":"#REF!"}}]
["0322",{"$f":"IF(Selection!$B$4=\"DK\",VLOOKUP($A83,'Style navne sprog'!$A:$I,6,FALSE),IF(Selection!$B$4=\"DE\",VLOOKUP($A83,'Style navne sprog'!$A:$I,2,FALSE),IF(Selection!$B$4=\"GB\",VLOOKUP($A83,'Style navne sprog'!$A:$I,4,FALSE),IF(Selection!$B$4=\"SE\",VLOOKUP($A83,'Style navne sprog'!$A:$I,3,FALSE),IF(Selection!$B$4=\"NO\",VLOOKUP($A83,'Style navne sprog'!$A:$I,5,FALSE),IF(Selection!$B$4=\"PL\",VLOOKUP($A83,'Style navne sprog'!$A:$I,7,FALSE)))))))","v":"PRO Wear polo shirt | contrast"},{"$f":"IF(Master!C83<>\"\",Master!C83*Selection!$B$3,\"\")","v":63.5},{"$f":"IF(Master!D83<>\"\",Master!D83*Selection!$B$3,\"\")","v":60.300000000000004},"3XL-6XL",{"$f":"IF(Master!F83<>\"\",Master!F83*Selection!$B$3,\"\")","v":5.4},{"$f":"IF(Factor!#REF!<>\"\",Factor!#REF!*Selection!$B$3,\"\")","v":{"$error":"#REF!"}}]
["0324",{"$f":"IF(Selection!$B$4=\"DK\",VLOOKUP($A84,'Style navne sprog'!$A:$I,6,FALSE),IF(Selection!$B$4=\"DE\",VLOOKUP($A84,'Style navne sprog'!$A:$I,2,FALSE),IF(Selection!$B$4=\"GB\",VLOOKUP($A84,'Style navne sprog'!$A:$I,4,FALSE),IF(Selection!$B$4=\"SE\",VLOOKUP($A84,'Style navne sprog'!$A:$I,3,FALSE),IF(Selection!$B$4=\"NO\",VLOOKUP($A84,'Style navne sprog'!$A:$I,5,FALSE),IF(Selection!$B$4=\"PL\",VLOOKUP($A84,'Style navne sprog'!$A:$I,7,FALSE)))))))","v":"PRO Wear polo shirt | no pocket"},{"$f":"IF(Master!C84<>\"\",Master!C84*Selection!$B$3,\"\")","v":55.6},{"$f":"IF(Master!D84<>\"\",Master!D84*Selection!$B$3,\"\")","v":52.300000000000004},"3XL-6XL",{"$f":"IF(Master!F84<>\"\",Master!F84*Selection!$B$3,\"\")","v":5.4},{"$f":"IF(Factor!#REF!<>\"\",Factor!#REF!*Selection!$B$3,\"\")","v":{"$error":"#REF!"}}]
["0326",{"$f":"IF(Selection!$B$4=\"DK\",VLOOKUP($A85,'Style navne sprog'!$A:$I,6,FALSE),IF(Selection!$B$4=\"DE\",VLOOKUP($A85,'Style navne sprog'!$A:$I,2,FALSE),IF(Selection!$B$4=\"GB\",VLOOKUP($A85,'Style navne sprog'!$A:$I,4,FALSE),IF(Selection!$B$4=\"SE\",VLOOKUP($A85,'Style navne sprog'!$A:$I,3,FALSE),IF(Selection!$B$4=\"NO\",VLOOKUP($A85,'Style navne sprog'!$A:$I,5,FALSE),IF(Selection!$B$4=\"PL\",VLOOKUP($A85,'Style navne sprog'!$A:$I,7,FALSE)))))))","v":"PRO Wear polo shirt | long-sleeve"},{"$f":"IF(Master!C85<>\"\",Master!C85*Selection!$B$3,\"\")","v":63.5},{"$f":"IF(Master!D85<>\"\",Master!D85*Selection!$B$3,\"\")","v":60.300000000000004},"3XL-6XL",{"$f":"IF(Master!F85<>\"\",Master!F85*Selection!$B$3,\"\")","v":5.4},{"$f":"IF(Factor!#REF!<>\"\",Factor!#REF!*Selection!$B$3,\"\")","v":{"$error":"#REF!"}}]
["0330",{"$f":"IF(Selection!$B$4=\"DK\",VLOOKUP($A86,'Style navne sprog'!$A:$I,6,FALSE),IF(Selection!$B$4=\"DE\",VLOOKUP($A86,'Style navne sprog'!$A:$I,2,FALSE),IF(Selection!$B$4=\"GB\",VLOOKUP($A86,'Style navne sprog'!$A:$I,4,FALSE),IF(Selection!$B$4=\"SE\",VLOOKUP($A86,'Style navne sprog'!$A:$I,3,FALSE),IF(Selection!$B$4=\"NO\",VLOOKUP($A86,'Style navne sprog'!$A:$I,5,FALSE),IF(Selection!$B$4=\"PL\",VLOOKUP($A86,'Style navne sprog'!$A:$I,7,FALSE)))))))","v":"PRO Wear polo shirt | press stud"},{"$f":"IF(Master!C86<>\"\",Master!C86*Selection!$B$3,\"\")","v":55.6},{"$f":"IF(Master!D86<>\"\",Master!D86*Selection!$B$3,\"\")","v":52.300000000000004},"3XL-6XL",{"$f":"IF(Master!F86<>\"\",Master!F86*Selection!$B$3,\"\")","v":5.4},{"$f":"IF(Factor!#REF!<>\"\",Factor!#REF!*Selection!$B$3,\"\")","v":{"$error":"#REF!"}}]
["0336",{"$f":"IF(Selection!$B$4=\"DK\",VLOOKUP($A87,'Style navne sprog'!$A:$I,6,FALSE),IF(Selection!$B$4=\"DE\",VLOOKUP($A87,'Style navne sprog'!$A:$I,2,FALSE),IF(Selection!$B$4=\"GB\",VLOOKUP($A87,'Style navne sprog'!$A:$I,4,FALSE),IF(Selection!$B$4=\"SE\",VLOOKUP($A87,'Style navne sprog'!$A:$I,3,FALSE),IF(Selection!$B$4=\"NO\",VLOOKUP($A87,'Style navne sprog'!$A:$I,5,FALSE),IF(Selection!$B$4=\"PL\",VLOOKUP($A87,'Style navne sprog'!$A:$I,7,FALSE)))))))","v":"PRO Wear long-sleeve polo shirt | press stud"},{"$f":"IF(Master!C87<>\"\",Master!C87*Selection!$B$3,\"\")","v":63.5},{"$f":"IF(Master!D87<>\"\",Master!D87*Selection!$B$3,\"\")","v":60.300000000000004},"3XL-6XL",{"$f":"IF(Master!F87<>\"\",Master!F87*Selection!$B$3,\"\")","v":5.4},{"$f":"IF(Factor!#REF!<>\"\",Factor!#REF!*Selection!$B$3,\"\")","v":{"$error":"#REF!"}}]
["0360",{"$f":"IF(Selection!$B$4=\"DK\",VLOOKUP($A88,'Style navne sprog'!$A:$I,6,FALSE),IF(Selection!$B$4=\"DE\",VLOOKUP($A88,'Style navne sprog'!$A:$I,2,FALSE),IF(Selection!$B$4=\"GB\",VLOOKUP($A88,'Style navne sprog'!$A:$I,4,FALSE),IF(Selection!$B$4=\"SE\",VLOOKUP($A88,'Style navne sprog'!$A:$I,3,FALSE),IF(Selection!$B$4=\"NO\",VLOOKUP($A88,'Style navne sprog'!$A:$I,5,FALSE),IF(Selection!$B$4=\"PL\",VLOOKUP($A88,'Style navne sprog'!$A:$I,7,FALSE)))))))","v":"PRO Wear sweatshirt | classic"},{"$f":"IF(Master!C88<>\"\",Master!C88*Selection!$B$3,\"\")","v":71.5},{"$f":"IF(Master!D88<>\"\",Master!D88*Selection!$B$3,\"\")","v":68.3},"3XL-6XL",{"$f":"IF(Master!F88<>\"\",Master!F88*Selection!$B$3,\"\")","v":5.4},{"$f":"IF(Factor!#REF!<>\"\",Factor!#REF!*Selection!$B$3,\"\")","v":{"$error":"#REF!"}}]
["0362",{"$f":"IF(Selection!$B$4=\"DK\",VLOOKUP($A89,'Style navne sprog'!$A:$I,6,FALSE),IF(Selection!$B$4=\"DE\",VLOOKUP($A89,'Style navne sprog'!$A:$I,2,FALSE),IF(Selection!$B$4=\"GB\",VLOOKUP($A89,'Style navne sprog'!$A:$I,4,FALSE),IF(Selection!$B$4=\"SE\",VLOOKUP($A89,'Style navne sprog'!$A:$I,3,FALSE),IF(Selection!$B$4=\"NO\",VLOOKUP($A89,'Style navne sprog'!$A:$I,5,FALSE),IF(Selection!$B$4=\"PL\",VLOOKUP($A89,'Style navne sprog'!$A:$I,7,FALSE)))))))","v":"PRO Wear sweatshirt | contrast"},{"$f":"IF(Master!C89<>\"\",Master!C89*Selection!$B$3,\"\")","v":79.600000000000009},{"$f":"IF(Master!D89<>\"\",Master!D89*Selection!$B$3,\"\")","v":76.400000000000006},"3XL-6XL",{"$f":"IF(Master!F89<>\"\",Master!F89*Selection!$B$3,\"\")","v":5.4},{"$f":"IF(Factor!#REF!<>\"\",Factor!#REF!*Selection!$B$3,\"\")","v":{"$error":"#REF!"}}]
["0366",{"$f":"IF(Selection!$B$4=\"DK\",VLOOKUP($A90,'Style navne sprog'!$A:$I,6,FALSE),IF(Selection!$B$4=\"DE\",VLOOKUP($A90,'Style navne sprog'!$A:$I,2,FALSE),IF(Selection!$B$4=\"GB\",VLOOKUP($A90,'Style navne sprog'!$A:$I,4,FALSE),IF(Selection!$B$4=\"SE\",VLOOKUP($A90,'Style navne sprog'!$A:$I,3,FALSE),IF(Selection!$B$4=\"NO\",VLOOKUP($A90,'Style navne sprog'!$A:$I,5,FALSE),IF(Selection!$B$4=\"PL\",VLOOKUP($A90,'Style navne sprog'!$A:$I,7,FALSE)))))))","v":"PRO Wear cardigan | sweat"},{"$f":"IF(Master!C90<>\"\",Master!C90*Selection!$B$3,\"\")","v":113.4},{"$f":"IF(Master!D90<>\"\",Master!D90*Selection!$B$3,\"\")","v":""},"3XL-6XL",{"$f":"IF(Master!F90<>\"\",Master!F90*Selection!$B$3,\"\")","v":5.4},{"$f":"IF(Factor!#REF!<>\"\",Factor!#REF!*Selection!$B$3,\"\")","v":{"$error":"#REF!"}}]
["0367",{"$f":"IF(Selection!$B$4=\"DK\",VLOOKUP($A91,'Style navne sprog'!$A:$I,6,FALSE),IF(Selection!$B$4=\"DE\",VLOOKUP($A91,'Style navne sprog'!$A:$I,2,FALSE),IF(Selection!$B$4=\"GB\",VLOOKUP($A91,'Style navne sprog'!$A:$I,4,FALSE),IF(Selection!$B$4=\"SE\",VLOOKUP($A91,'Style navne sprog'!$A:$I,3,FALSE),IF(Selection!$B$4=\"NO\",VLOOKUP($A91,'Style navne sprog'!$A:$I,5,FALSE),IF(Selection!$B$4=\"PL\",VLOOKUP($A91,'Style navne sprog'!$A:$I,7,FALSE)))))))","v":"PRO Wear cardigan | sweat | women"},{"$f":"IF(Master!C91<>\"\",Master!C91*Selection!$B$3,\"\")","v":113.4},{"$f":"IF(Master!D91<>\"\",Master!D91*Selection!$B$3,\"\")","v":""},"3XL-6XL",{"$f":"IF(Master!F91<>\"\",Master!F91*Selection!$B$3,\"\")","v":5.4},{"$f":"IF(Factor!#REF!<>\"\",Factor!#REF!*Selection!$B$3,\"\")","v":{"$error":"#REF!"}}]
["0370",{"$f":"IF(Selection!$B$4=\"DK\",VLOOKUP($A92,'Style navne sprog'!$A:$I,6,FALSE),IF(Selection!$B$4=\"DE\",VLOOKUP($A92,'Style navne sprog'!$A:$I,2,FALSE),IF(Selection!$B$4=\"GB\",VLOOKUP($A92,'Style navne sprog'!$A:$I,4,FALSE),IF(Selection!$B$4=\"SE\",VLOOKUP($A92,'Style navne sprog'!$A:$I,3,FALSE),IF(Selection!$B$4=\"NO\",VLOOKUP($A92,'Style navne sprog'!$A:$I,5,FALSE),IF(Selection!$B$4=\"PL\",VLOOKUP($A92,'Style navne sprog'!$A:$I,7,FALSE)))))))","v":"PRO Wear CARE T-shirt"},{"$f":"IF(Master!C92<>\"\",Master!C92*Selection!$B$3,\"\")","v":31.700000000000003},{"$f":"IF(Master!D92<>\"\",Master!D92*Selection!$B$3,\"\")","v":30.1},"3XL-6XL",{"$f":"IF(Master!F92<>\"\",Master!F92*Selection!$B$3,\"\")","v":2.8000000000000003},{"$f":"IF(Factor!#REF!<>\"\",Factor!#REF!*Selection!$B$3,\"\")","v":{"$error":"#REF!"}}]
["0371",{"$f":"IF(Selection!$B$4=\"DK\",VLOOKUP($A93,'Style navne sprog'!$A:$I,6,FALSE),IF(Selection!$B$4=\"DE\",VLOOKUP($A93,'Style navne sprog'!$A:$I,2,FALSE),IF(Selection!$B$4=\"GB\",VLOOKUP($A93,'Style navne sprog'!$A:$I,4,FALSE),IF(Selection!$B$4=\"SE\",VLOOKUP($A93,'Style navne sprog'!$A:$I,3,FALSE),IF(Selection!$B$4=\"NO\",VLOOKUP($A93,'Style navne sprog'!$A:$I,5,FALSE),IF(Selection!$B$4=\"PL\",VLOOKUP($A93,'Style navne sprog'!$A:$I,7,FALSE)))))))","v":"PRO Wear CARE T-shirt | women"},{"$f":"IF(Master!C93<>\"\",Master!C93*Selection!$B$3,\"\")","v":31.700000000000003},{"$f":"IF(Master!D93<>\"\",Master!D93*Selection!$B$3,\"\")","v":30.1},"3XL-6XL",{"$f":"IF(Master!F93<>\"\",Master!F93*Selection!$B$3,\"\")","v":2.8000000000000003},{"$f":"IF(Factor!#REF!<>\"\",Factor!#REF!*Selection!$B$3,\"\")","v":{"$error":"#REF!"}}]
["0372",{"$f":"IF(Selection!$B$4=\"DK\",VLOOKUP($A94,'Style navne sprog'!$A:$I,6,FALSE),IF(Selection!$B$4=\"DE\",VLOOKUP($A94,'Style navne sprog'!$A:$I,2,FALSE),IF(Selection!$B$4=\"GB\",VLOOKUP($A94,'Style navne sprog'!$A:$I,4,FALSE),IF(Selection!$B$4=\"SE\",VLOOKUP($A94,'Style navne sprog'!$A:$I,3,FALSE),IF(Selection!$B$4=\"NO\",VLOOKUP($A94,'Style navne sprog'!$A:$I,5,FALSE),IF(Selection!$B$4=\"PL\",VLOOKUP($A94,'Style navne sprog'!$A:$I,7,FALSE)))))))","v":"PRO Wear CARE T-shirt | v-neck"},{"$f":"IF(Master!C94<>\"\",Master!C94*Selection!$B$3,\"\")","v":31.700000000000003},{"$f":"IF(Master!D94<>\"\",Master!D94*Selection!$B$3,\"\")","v":30.1},"3XL-6XL",{"$f":"IF(Master!F94<>\"\",Master!F94*Selection!$B$3,\"\")","v":2.8000000000000003},{"$f":"IF(Factor!#REF!<>\"\",Factor!#REF!*Selection!$B$3,\"\")","v":{"$error":"#REF!"}}]
["0373",{"$f":"IF(Selection!$B$4=\"DK\",VLOOKUP($A95,'Style navne sprog'!$A:$I,6,FALSE),IF(Selection!$B$4=\"DE\",VLOOKUP($A95,'Style navne sprog'!$A:$I,2,FALSE),IF(Selection!$B$4=\"GB\",VLOOKUP($A95,'Style navne sprog'!$A:$I,4,FALSE),IF(Selection!$B$4=\"SE\",VLOOKUP($A95,'Style navne sprog'!$A:$I,3,FALSE),IF(Selection!$B$4=\"NO\",VLOOKUP($A95,'Style navne sprog'!$A:$I,5,FALSE),IF(Selection!$B$4=\"PL\",VLOOKUP($A95,'Style navne sprog'!$A:$I,7,FALSE)))))))","v":"PRO Wear CARE T-shirt | v-neck | women"},{"$f":"IF(Master!C95<>\"\",Master!C95*Selection!$B$3,\"\")","v":31.700000000000003},{"$f":"IF(Master!D95<>\"\",Master!D95*Selection!$B$3,\"\")","v":30.1},"3XL-6XL",{"$f":"IF(Master!F95<>\"\",Master!F95*Selection!$B$3,\"\")","v":2.8000000000000003},{"$f":"IF(Factor!#REF!<>\"\",Factor!#REF!*Selection!$B$3,\"\")","v":{"$error":"#REF!"}}]
["0374",{"$f":"IF(Selection!$B$4=\"DK\",VLOOKUP($A96,'Style navne sprog'!$A:$I,6,FALSE),IF(Selection!$B$4=\"DE\",VLOOKUP($A96,'Style navne sprog'!$A:$I,2,FALSE),IF(Selection!$B$4=\"GB\",VLOOKUP($A96,'Style navne sprog'!$A:$I,4,FALSE),IF(Selection!$B$4=\"SE\",VLOOKUP($A96,'Style navne sprog'!$A:$I,3,FALSE),IF(Selection!$B$4=\"NO\",VLOOKUP($A96,'Style navne sprog'!$A:$I,5,FALSE),IF(Selection!$B$4=\"PL\",VLOOKUP($A96,'Style navne sprog'!$A:$I,7,FALSE)))))))","v":"PRO Wear CARE polo shirt"},{"$f":"IF(Master!C96<>\"\",Master!C96*Selection!$B$3,\"\")","v":61.2},{"$f":"IF(Master!D96<>\"\",Master!D96*Selection!$B$3,\"\")","v":58},"3XL-6XL",{"$f":"IF(Master!F96<>\"\",Master!F96*Selection!$B$3,\"\")","v":5.4},{"$f":"IF(Factor!#REF!<>\"\",Factor!#REF!*Selection!$B$3,\"\")","v":{"$error":"#REF!"}}]
["0375",{"$f":"IF(Selection!$B$4=\"DK\",VLOOKUP($A97,'Style navne sprog'!$A:$I,6,FALSE),IF(Selection!$B$4=\"DE\",VLOOKUP($A97,'Style navne sprog'!$A:$I,2,FALSE),IF(Selection!$B$4=\"GB\",VLOOKUP($A97,'Style navne sprog'!$A:$I,4,FALSE),IF(Selection!$B$4=\"SE\",VLOOKUP($A97,'Style navne sprog'!$A:$I,3,FALSE),IF(Selection!$B$4=\"NO\",VLOOKUP($A97,'Style navne sprog'!$A:$I,5,FALSE),IF(Selection!$B$4=\"PL\",VLOOKUP($A97,'Style navne sprog'!$A:$I,7,FALSE)))))))","v":"PRO Wear CARE polo shirt | women"},{"$f":"IF(Master!C97<>\"\",Master!C97*Selection!$B$3,\"\")","v":61.2},{"$f":"IF(Master!D97<>\"\",Master!D97*Selection!$B$3,\"\")","v":58},"3XL-6XL",{"$f":"IF(Master!F97<>\"\",Master!F97*Selection!$B$3,\"\")","v":5.4},{"$f":"IF(Factor!#REF!<>\"\",Factor!#REF!*Selection!$B$3,\"\")","v":{"$error":"#REF!"}}]
["0376",{"$f":"IF(Selection!$B$4=\"DK\",VLOOKUP($A98,'Style navne sprog'!$A:$I,6,FALSE),IF(Selection!$B$4=\"DE\",VLOOKUP($A98,'Style navne sprog'!$A:$I,2,FALSE),IF(Selection!$B$4=\"GB\",VLOOKUP($A98,'Style navne sprog'!$A:$I,4,FALSE),IF(Selection!$B$4=\"SE\",VLOOKUP($A98,'Style navne sprog'!$A:$I,3,FALSE),IF(Selection!$B$4=\"NO\",VLOOKUP($A98,'Style navne sprog'!$A:$I,5,FALSE),IF(Selection!$B$4=\"PL\",VLOOKUP($A98,'Style navne sprog'!$A:$I,7,FALSE)))))))","v":"PRO Wear CARE polo shirt | classic"},{"$f":"IF(Master!C98<>\"\",Master!C98*Selection!$B$3,\"\")","v":58},{"$f":"IF(Master!D98<>\"\",Master!D98*Selection!$B$3,\"\")","v":54.800000000000004},"3XL-6XL",{"$f":"IF(Master!F98<>\"\",Master!F98*Selection!$B$3,\"\")","v":5.4},{"$f":"IF(Factor!#REF!<>\"\",Factor!#REF!*Selection!$B$3,\"\")","v":{"$error":"#REF!"}}]
["0377",{"$f":"IF(Selection!$B$4=\"DK\",VLOOKUP($A99,'Style navne sprog'!$A:$I,6,FALSE),IF(Selection!$B$4=\"DE\",VLOOKUP($A99,'Style navne sprog'!$A:$I,2,FALSE),IF(Selection!$B$4=\"GB\",VLOOKUP($A99,'Style navne sprog'!$A:$I,4,FALSE),IF(Selection!$B$4=\"SE\",VLOOKUP($A99,'Style navne sprog'!$A:$I,3,FALSE),IF(Selection!$B$4=\"NO\",VLOOKUP($A99,'Style navne sprog'!$A:$I,5,FALSE),IF(Selection!$B$4=\"PL\",VLOOKUP($A99,'Style navne sprog'!$A:$I,7,FALSE)))))))","v":"PRO Wear CARE polo shirt | classic | women"},{"$f":"IF(Master!C99<>\"\",Master!C99*Selection!$B$3,\"\")","v":58},{"$f":"IF(Master!D99<>\"\",Master!D99*Selection!$B$3,\"\")","v":54.800000000000004},"3XL-6XL",{"$f":"IF(Master!F99<>\"\",Master!F99*Selection!$B$3,\"\")","v":5.4},{"$f":"IF(Factor!#REF!<>\"\",Factor!#REF!*Selection!$B$3,\"\")","v":{"$error":"#REF!"}}]
["0380",{"$f":"IF(Selection!$B$4=\"DK\",VLOOKUP($A100,'Style navne sprog'!$A:$I,6,FALSE),IF(Selection!$B$4=\"DE\",VLOOKUP($A100,'Style navne sprog'!$A:$I,2,FALSE),IF(Selection!$B$4=\"GB\",VLOOKUP($A100,'Style navne sprog'!$A:$I,4,FALSE),IF(Selection!$B$4=\"SE\",VLOOKUP($A100,'Style navne sprog'!$A:$I,3,FALSE),IF(Selection!$B$4=\"NO\",VLOOKUP($A100,'Style navne sprog'!$A:$I,5,FALSE),IF(Selection!$B$4=\"PL\",VLOOKUP($A100,'Style navne sprog'!$A:$I,7,FALSE)))))))","v":"PRO Wear CARE sweatshirt | unbrushed"},{"$f":"IF(Master!C100<>\"\",Master!C100*Selection!$B$3,\"\")","v":72.2},{"$f":"IF(Master!D100<>\"\",Master!D100*Selection!$B$3,\"\")","v":69},"3XL-6XL",{"$f":"IF(Master!F100<>\"\",Master!F100*Selection!$B$3,\"\")","v":5.4},{"$f":"IF(Factor!#REF!<>\"\",Factor!#REF!*Selection!$B$3,\"\")","v":{"$error":"#REF!"}}]
["0381",{"$f":"IF(Selection!$B$4=\"DK\",VLOOKUP($A101,'Style navne sprog'!$A:$I,6,FALSE),IF(Selection!$B$4=\"DE\",VLOOKUP($A101,'Style navne sprog'!$A:$I,2,FALSE),IF(Selection!$B$4=\"GB\",VLOOKUP($A101,'Style navne sprog'!$A:$I,4,FALSE),IF(Selection!$B$4=\"SE\",VLOOKUP($A101,'Style navne sprog'!$A:$I,3,FALSE),IF(Selection!$B$4=\"NO\",VLOOKUP($A101,'Style navne sprog'!$A:$I,5,FALSE),IF(Selection!$B$4=\"PL\",VLOOKUP($A101,'Style navne sprog'!$A:$I,7,FALSE)))))))","v":"PRO Wear CARE sweatshirt | unbrushed | women"},{"$f":"IF(Master!C101<>\"\",Master!C101*Selection!$B$3,\"\")","v":72.2},{"$f":"IF(Master!D101<>\"\",Master!D101*Selection!$B$3,\"\")","v":69},"3XL-6XL",{"$f":"IF(Master!F101<>\"\",Master!F101*Selection!$B$3,\"\")","v":5.4},{"$f":"IF(Factor!#REF!<>\"\",Factor!#REF!*Selection!$B$3,\"\")","v":{"$error":"#REF!"}}]
["0382",{"$f":"IF(Selection!$B$4=\"DK\",VLOOKUP($A102,'Style navne sprog'!$A:$I,6,FALSE),IF(Selection!$B$4=\"DE\",VLOOKUP($A102,'Style navne sprog'!$A:$I,2,FALSE),IF(Selection!$B$4=\"GB\",VLOOKUP($A102,'Style navne sprog'!$A:$I,4,FALSE),IF(Selection!$B$4=\"SE\",VLOOKUP($A102,'Style navne sprog'!$A:$I,3,FALSE),IF(Selection!$B$4=\"NO\",VLOOKUP($A102,'Style navne sprog'!$A:$I,5,FALSE),IF(Selection!$B$4=\"PL\",VLOOKUP($A102,'Style navne sprog'!$A:$I,7,FALSE)))))))","v":"PRO Wear CARE cardigan | unbrushed"},{"$f":"IF(Master!C102<>\"\",Master!C102*Selection!$B$3,\"\")","v":115.30000000000001},{"$f":"IF(Master!D102<>\"\",Master!D102*Selection!$B$3,\"\")","v":""},"3XL-6XL",{"$f":"IF(Master!F102<>\"\",Master!F102*Selection!$B$3,\"\")","v":5.4},{"$f":"IF(Factor!#REF!<>\"\",Factor!#REF!*Selection!$B$3,\"\")","v":{"$error":"#REF!"}}]
["0383",{"$f":"IF(Selection!$B$4=\"DK\",VLOOKUP($A103,'Style navne sprog'!$A:$I,6,FALSE),IF(Selection!$B$4=\"DE\",VLOOKUP($A103,'Style navne sprog'!$A:$I,2,FALSE),IF(Selection!$B$4=\"GB\",VLOOKUP($A103,'Style navne sprog'!$A:$I,4,FALSE),IF(Selection!$B$4=\"SE\",VLOOKUP($A103,'Style navne sprog'!$A:$I,3,FALSE),IF(Selection!$B$4=\"NO\",VLOOKUP($A103,'Style navne sprog'!$A:$I,5,FALSE),IF(Selection!$B$4=\"PL\",VLOOKUP($A103,'Style navne sprog'!$A:$I,7,FALSE)))))))","v":"PRO Wear CARE cardigan | unbrushed | women"},{"$f":"IF(Master!C103<>\"\",Master!C103*Selection!$B$3,\"\")","v":115.30000000000001},{"$f":"IF(Master!D103<>\"\",Master!D103*Selection!$B$3,\"\")","v":""},"3XL-6XL",{"$f":"IF(Master!F103<>\"\",Master!F103*Selection!$B$3,\"\")","v":5.4},{"$f":"IF(Factor!#REF!<>\"\",Factor!#REF!*Selection!$B$3,\"\")","v":{"$error":"#REF!"}}]
["0384",{"$f":"IF(Selection!$B$4=\"DK\",VLOOKUP($A104,'Style navne sprog'!$A:$I,6,FALSE),IF(Selection!$B$4=\"DE\",VLOOKUP($A104,'Style navne sprog'!$A:$I,2,FALSE),IF(Selection!$B$4=\"GB\",VLOOKUP($A104,'Style navne sprog'!$A:$I,4,FALSE),IF(Selection!$B$4=\"SE\",VLOOKUP($A104,'Style navne sprog'!$A:$I,3,FALSE),IF(Selection!$B$4=\"NO\",VLOOKUP($A104,'Style navne sprog'!$A:$I,5,FALSE),IF(Selection!$B$4=\"PL\",VLOOKUP($A104,'Style navne sprog'!$A:$I,7,FALSE)))))))","v":"PRO Wear CARE sweat | unbrushed | ¼ zip"},{"$f":"IF(Master!C104<>\"\",Master!C104*Selection!$B$3,\"\")","v":104.60000000000001},{"$f":"IF(Master!D104<>\"\",Master!D104*Selection!$B$3,\"\")","v":""},"3XL-6XL",{"$f":"IF(Master!F104<>\"\",Master!F104*Selection!$B$3,\"\")","v":5.4},{"$f":"IF(Factor!#REF!<>\"\",Factor!#REF!*Selection!$B$3,\"\")","v":{"$error":"#REF!"}}]
["0385",{"$f":"IF(Selection!$B$4=\"DK\",VLOOKUP($A105,'Style navne sprog'!$A:$I,6,FALSE),IF(Selection!$B$4=\"DE\",VLOOKUP($A105,'Style navne sprog'!$A:$I,2,FALSE),IF(Selection!$B$4=\"GB\",VLOOKUP($A105,'Style navne sprog'!$A:$I,4,FALSE),IF(Selection!$B$4=\"SE\",VLOOKUP($A105,'Style navne sprog'!$A:$I,3,FALSE),IF(Selection!$B$4=\"NO\",VLOOKUP($A105,'Style navne sprog'!$A:$I,5,FALSE),IF(Selection!$B$4=\"PL\",VLOOKUP($A105,'Style navne sprog'!$A:$I,7,FALSE)))))))","v":"PRO Wear CARE sweat  | unbrushed | ¼ zip | women"},{"$f":"IF(Master!C105<>\"\",Master!C105*Selection!$B$3,\"\")","v":104.60000000000001},{"$f":"IF(Master!D105<>\"\",Master!D105*Selection!$B$3,\"\")","v":""},"3XL-6XL",{"$f":"IF(Master!F105<>\"\",Master!F105*Selection!$B$3,\"\")","v":5.4},{"$f":"IF(Factor!#REF!<>\"\",Factor!#REF!*Selection!$B$3,\"\")","v":{"$error":"#REF!"}}]
[]
[{"$f":"IF(Selection!$B$4=\"PL\",\"KOSZULE\",IF(Selection!$B$4=\"SE\",\"SKJORTOR\",IF(Selection!$B$4=\"GB\",\"SHIRTS\",IF(Selection!$B$4=\"DE\",\"HEMDEN & BLUSEN\",\"SKJORTER\"))))","v":"SHIRTS"}]
["0204",{"$f":"IF(Selection!$B$4=\"DK\",VLOOKUP($A108,'Style navne sprog'!$A:$I,6,FALSE),IF(Selection!$B$4=\"DE\",VLOOKUP($A108,'Style navne sprog'!$A:$I,2,FALSE),IF(Selection!$B$4=\"GB\",VLOOKUP($A108,'Style navne sprog'!$A:$I,4,FALSE),IF(Selection!$B$4=\"SE\",VLOOKUP($A108,'Style navne sprog'!$A:$I,3,FALSE),IF(Selection!$B$4=\"NO\",VLOOKUP($A108,'Style navne sprog'!$A:$I,5,FALSE),IF(Selection!$B$4=\"PL\",VLOOKUP($A108,'Style navne sprog'!$A:$I,7,FALSE)))))))","v":"Green leaf shirt | press stud"},{"$f":"IF(Master!C108<>\"\",Master!C108*Selection!$B$3,\"\")","v":76},{"$f":"IF(Master!D108<>\"\",Master!D108*Selection!$B$3,\"\")","v":""},"47/48-49/50",{"$f":"IF(Master!F108<>\"\",Master!F108*Selection!$B$3,\"\")","v":5.4},{"$f":"IF(Factor!#REF!<>\"\",Factor!#REF!*Selection!$B$3,\"\")","v":{"$error":"#REF!"}}]
[]
[{"$f":"IF(Selection!$B$4=\"PL\",\"ODZIEZ Z POLARU\",\"FLEECE\")","v":"FLEECE"}]
["0744",{"$f":"IF(Selection!$B$4=\"DK\",VLOOKUP($A111,'Style navne sprog'!$A:$I,6,FALSE),IF(Selection!$B$4=\"DE\",VLOOKUP($A111,'Style navne sprog'!$A:$I,2,FALSE),IF(Selection!$B$4=\"GB\",VLOOKUP($A111,'Style navne sprog'!$A:$I,4,FALSE),IF(Selection!$B$4=\"SE\",VLOOKUP($A111,'Style navne sprog'!$A:$I,3,FALSE),IF(Selection!$B$4=\"NO\",VLOOKUP($A111,'Style navne sprog'!$A:$I,5,FALSE),IF(Selection!$B$4=\"PL\",VLOOKUP($A111,'Style navne sprog'!$A:$I,7,FALSE)))))))","v":"Bonded fleece jacket"},{"$f":"IF(Master!C111<>\"\",Master!C111*Selection!$B$3,\"\")","v":128.6},{"$f":"IF(Master!D111<>\"\",Master!D111*Selection!$B$3,\"\")","v":""},"3XL-4XL",{"$f":"IF(Master!F111<>\"\",Master!F111*Selection!$B$3,\"\")","v":8},{"$f":"IF(Factor!#REF!<>\"\",Factor!#REF!*Selection!$B$3,\"\")","v":{"$error":"#REF!"}}]
["0745",{"$f":"IF(Selection!$B$4=\"DK\",VLOOKUP($A112,'Style navne sprog'!$A:$I,6,FALSE),IF(Selection!$B$4=\"DE\",VLOOKUP($A112,'Style navne sprog'!$A:$I,2,FALSE),IF(Selection!$B$4=\"GB\",VLOOKUP($A112,'Style navne sprog'!$A:$I,4,FALSE),IF(Selection!$B$4=\"SE\",VLOOKUP($A112,'Style navne sprog'!$A:$I,3,FALSE),IF(Selection!$B$4=\"NO\",VLOOKUP($A112,'Style navne sprog'!$A:$I,5,FALSE),IF(Selection!$B$4=\"PL\",VLOOKUP($A112,'Style navne sprog'!$A:$I,7,FALSE)))))))","v":"Bonded fleece jacket | women"},{"$f":"IF(Master!C112<>\"\",Master!C112*Selection!$B$3,\"\")","v":128.6},{"$f":"IF(Master!D112<>\"\",Master!D112*Selection!$B$3,\"\")","v":""},"3XL-4XL",{"$f":"IF(Master!F112<>\"\",Master!F112*Selection!$B$3,\"\")","v":8},{"$f":"IF(Factor!#REF!<>\"\",Factor!#REF!*Selection!$B$3,\"\")","v":{"$error":"#REF!"}}]
["0746",{"$f":"IF(Selection!$B$4=\"DK\",VLOOKUP($A113,'Style navne sprog'!$A:$I,6,FALSE),IF(Selection!$B$4=\"DE\",VLOOKUP($A113,'Style navne sprog'!$A:$I,2,FALSE),IF(Selection!$B$4=\"GB\",VLOOKUP($A113,'Style navne sprog'!$A:$I,4,FALSE),IF(Selection!$B$4=\"SE\",VLOOKUP($A113,'Style navne sprog'!$A:$I,3,FALSE),IF(Selection!$B$4=\"NO\",VLOOKUP($A113,'Style navne sprog'!$A:$I,5,FALSE),IF(Selection!$B$4=\"PL\",VLOOKUP($A113,'Style navne sprog'!$A:$I,7,FALSE)))))))","v":"Bonded fleece vest"},{"$f":"IF(Master!C113<>\"\",Master!C113*Selection!$B$3,\"\")","v":107.10000000000001},{"$f":"IF(Master!D113<>\"\",Master!D113*Selection!$B$3,\"\")","v":""},"3XL-4XL",{"$f":"IF(Master!F113<>\"\",Master!F113*Selection!$B$3,\"\")","v":8},{"$f":"IF(Factor!#REF!<>\"\",Factor!#REF!*Selection!$B$3,\"\")","v":{"$error":"#REF!"}}]
["0747",{"$f":"IF(Selection!$B$4=\"DK\",VLOOKUP($A114,'Style navne sprog'!$A:$I,6,FALSE),IF(Selection!$B$4=\"DE\",VLOOKUP($A114,'Style navne sprog'!$A:$I,2,FALSE),IF(Selection!$B$4=\"GB\",VLOOKUP($A114,'Style navne sprog'!$A:$I,4,FALSE),IF(Selection!$B$4=\"SE\",VLOOKUP($A114,'Style navne sprog'!$A:$I,3,FALSE),IF(Selection!$B$4=\"NO\",VLOOKUP($A114,'Style navne sprog'!$A:$I,5,FALSE),IF(Selection!$B$4=\"PL\",VLOOKUP($A114,'Style navne sprog'!$A:$I,7,FALSE)))))))","v":"Bonded fleece vest | women"},{"$f":"IF(Master!C114<>\"\",Master!C114*Selection!$B$3,\"\")","v":107.10000000000001},{"$f":"IF(Master!D114<>\"\",Master!D114*Selection!$B$3,\"\")","v":""},"3XL-4XL",{"$f":"IF(Master!F114<>\"\",Master!F114*Selection!$B$3,\"\")","v":8},{"$f":"IF(Factor!#REF!<>\"\",Factor!#REF!*Selection!$B$3,\"\")","v":{"$error":"#REF!"}}]
["0792",{"$f":"IF(Selection!$B$4=\"DK\",VLOOKUP($A115,'Style navne sprog'!$A:$I,6,FALSE),IF(Selection!$B$4=\"DE\",VLOOKUP($A115,'Style navne sprog'!$A:$I,2,FALSE),IF(Selection!$B$4=\"GB\",VLOOKUP($A115,'Style navne sprog'!$A:$I,4,FALSE),IF(Selection!$B$4=\"SE\",VLOOKUP($A115,'Style navne sprog'!$A:$I,3,FALSE),IF(Selection!$B$4=\"NO\",VLOOKUP($A115,'Style navne sprog'!$A:$I,5,FALSE),IF(Selection!$B$4=\"PL\",VLOOKUP($A115,'Style navne sprog'!$A:$I,7,FALSE)))))))","v":"Zip-n-Mix microfleece | reflective"},{"$f":"IF(Master!C115<>\"\",Master!C115*Selection!$B$3,\"\")","v":123.2},{"$f":"IF(Master!D115<>\"\",Master!D115*Selection!$B$3,\"\")","v":""},"3XL-6XL",{"$f":"IF(Master!F115<>\"\",Master!F115*Selection!$B$3,\"\")","v":8},{"$f":"IF(Factor!#REF!<>\"\",Factor!#REF!*Selection!$B$3,\"\")","v":{"$error":"#REF!"}}]
["0793",{"$f":"IF(Selection!$B$4=\"DK\",VLOOKUP($A116,'Style navne sprog'!$A:$I,6,FALSE),IF(Selection!$B$4=\"DE\",VLOOKUP($A116,'Style navne sprog'!$A:$I,2,FALSE),IF(Selection!$B$4=\"GB\",VLOOKUP($A116,'Style navne sprog'!$A:$I,4,FALSE),IF(Selection!$B$4=\"SE\",VLOOKUP($A116,'Style navne sprog'!$A:$I,3,FALSE),IF(Selection!$B$4=\"NO\",VLOOKUP($A116,'Style navne sprog'!$A:$I,5,FALSE),IF(Selection!$B$4=\"PL\",VLOOKUP($A116,'Style navne sprog'!$A:$I,7,FALSE)))))))","v":"Zip-n-Mix  microfleece | reflective | women"},{"$f":"IF(Master!C116<>\"\",Master!C116*Selection!$B$3,\"\")","v":123.2},{"$f":"IF(Master!D116<>\"\",Master!D116*Selection!$B$3,\"\")","v":""},"3XL-6XL",{"$f":"IF(Master!F116<>\"\",Master!F116*Selection!$B$3,\"\")","v":8},{"$f":"IF(Factor!#REF!<>\"\",Factor!#REF!*Selection!$B$3,\"\")","v":{"$error":"#REF!"}}]
["0803",{"$f":"IF(Selection!$B$4=\"DK\",VLOOKUP($A117,'Style navne sprog'!$A:$I,6,FALSE),IF(Selection!$B$4=\"DE\",VLOOKUP($A117,'Style navne sprog'!$A:$I,2,FALSE),IF(Selection!$B$4=\"GB\",VLOOKUP($A117,'Style navne sprog'!$A:$I,4,FALSE),IF(Selection!$B$4=\"SE\",VLOOKUP($A117,'Style navne sprog'!$A:$I,3,FALSE),IF(Selection!$B$4=\"NO\",VLOOKUP($A117,'Style navne sprog'!$A:$I,5,FALSE),IF(Selection!$B$4=\"PL\",VLOOKUP($A117,'Style navne sprog'!$A:$I,7,FALSE)))))))","v":"Cardigan | microfleece"},{"$f":"IF(Master!C117<>\"\",Master!C117*Selection!$B$3,\"\")","v":77.7},{"$f":"IF(Master!D117<>\"\",Master!D117*Selection!$B$3,\"\")","v":""},"3XL-5XL",{"$f":"IF(Master!F117<>\"\",Master!F117*Selection!$B$3,\"\")","v":8},{"$f":"IF(Factor!#REF!<>\"\",Factor!#REF!*Selection!$B$3,\"\")","v":{"$error":"#REF!"}}]
["0805",{"$f":"IF(Selection!$B$4=\"DK\",VLOOKUP($A118,'Style navne sprog'!$A:$I,6,FALSE),IF(Selection!$B$4=\"DE\",VLOOKUP($A118,'Style navne sprog'!$A:$I,2,FALSE),IF(Selection!$B$4=\"GB\",VLOOKUP($A118,'Style navne sprog'!$A:$I,4,FALSE),IF(Selection!$B$4=\"SE\",VLOOKUP($A118,'Style navne sprog'!$A:$I,3,FALSE),IF(Selection!$B$4=\"NO\",VLOOKUP($A118,'Style navne sprog'!$A:$I,5,FALSE),IF(Selection!$B$4=\"PL\",VLOOKUP($A118,'Style navne sprog'!$A:$I,7,FALSE)))))))","v":"Cardigan | microfleece | women"},{"$f":"IF(Master!C118<>\"\",Master!C118*Selection!$B$3,\"\")","v":77.7},{"$f":"IF(Master!D118<>\"\",Master!D118*Selection!$B$3,\"\")","v":""},"3XL",{"$f":"IF(Master!F118<>\"\",Master!F118*Selection!$B$3,\"\")","v":8},{"$f":"IF(Factor!#REF!<>\"\",Factor!#REF!*Selection!$B$3,\"\")","v":{"$error":"#REF!"}}]
["0806",{"$f":"IF(Selection!$B$4=\"DK\",VLOOKUP($A119,'Style navne sprog'!$A:$I,6,FALSE),IF(Selection!$B$4=\"DE\",VLOOKUP($A119,'Style navne sprog'!$A:$I,2,FALSE),IF(Selection!$B$4=\"GB\",VLOOKUP($A119,'Style navne sprog'!$A:$I,4,FALSE),IF(Selection!$B$4=\"SE\",VLOOKUP($A119,'Style navne sprog'!$A:$I,3,FALSE),IF(Selection!$B$4=\"NO\",VLOOKUP($A119,'Style navne sprog'!$A:$I,5,FALSE),IF(Selection!$B$4=\"PL\",VLOOKUP($A119,'Style navne sprog'!$A:$I,7,FALSE)))))))","v":"Zip-n-Mix microfleece"},{"$f":"IF(Master!C119<>\"\",Master!C119*Selection!$B$3,\"\")","v":77.7},{"$f":"IF(Master!D119<>\"\",Master!D119*Selection!$B$3,\"\")","v":""},"3XL-4XL",{"$f":"IF(Master!F119<>\"\",Master!F119*Selection!$B$3,\"\")","v":8},{"$f":"IF(Factor!#REF!<>\"\",Factor!#REF!*Selection!$B$3,\"\")","v":{"$error":"#REF!"}}]
["0807",{"$f":"IF(Selection!$B$4=\"DK\",VLOOKUP($A120,'Style navne sprog'!$A:$I,6,FALSE),IF(Selection!$B$4=\"DE\",VLOOKUP($A120,'Style navne sprog'!$A:$I,2,FALSE),IF(Selection!$B$4=\"GB\",VLOOKUP($A120,'Style navne sprog'!$A:$I,4,FALSE),IF(Selection!$B$4=\"SE\",VLOOKUP($A120,'Style navne sprog'!$A:$I,3,FALSE),IF(Selection!$B$4=\"NO\",VLOOKUP($A120,'Style navne sprog'!$A:$I,5,FALSE),IF(Selection!$B$4=\"PL\",VLOOKUP($A120,'Style navne sprog'!$A:$I,7,FALSE)))))))","v":"Zip-n-Mix microfleece | women"},{"$f":"IF(Master!C120<>\"\",Master!C120*Selection!$B$3,\"\")","v":77.7},{"$f":"IF(Master!D120<>\"\",Master!D120*Selection!$B$3,\"\")","v":""},"3XL",{"$f":"IF(Master!F120<>\"\",Master!F120*Selection!$B$3,\"\")","v":8},{"$f":"IF(Factor!#REF!<>\"\",Factor!#REF!*Selection!$B$3,\"\")","v":{"$error":"#REF!"}}]
["0808",{"$f":"IF(Selection!$B$4=\"DK\",VLOOKUP($A121,'Style navne sprog'!$A:$I,6,FALSE),IF(Selection!$B$4=\"DE\",VLOOKUP($A121,'Style navne sprog'!$A:$I,2,FALSE),IF(Selection!$B$4=\"GB\",VLOOKUP($A121,'Style navne sprog'!$A:$I,4,FALSE),IF(Selection!$B$4=\"SE\",VLOOKUP($A121,'Style navne sprog'!$A:$I,3,FALSE),IF(Selection!$B$4=\"NO\",VLOOKUP($A121,'Style navne sprog'!$A:$I,5,FALSE),IF(Selection!$B$4=\"PL\",VLOOKUP($A121,'Style navne sprog'!$A:$I,7,FALSE)))))))","v":"Fleece tunic | unisex"},{"$f":"IF(Master!C121<>\"\",Master!C121*Selection!$B$3,\"\")","v":67},{"$f":"IF(Master!D121<>\"\",Master!D121*Selection!$B$3,\"\")","v":""},"3XL-6XL",{"$f":"IF(Master!F121<>\"\",Master!F121*Selection!$B$3,\"\")","v":8},{"$f":"IF(Factor!#REF!<>\"\",Factor!#REF!*Selection!$B$3,\"\")","v":{"$error":"#REF!"}}]
["0809",{"$f":"IF(Selection!$B$4=\"DK\",VLOOKUP($A122,'Style navne sprog'!$A:$I,6,FALSE),IF(Selection!$B$4=\"DE\",VLOOKUP($A122,'Style navne sprog'!$A:$I,2,FALSE),IF(Selection!$B$4=\"GB\",VLOOKUP($A122,'Style navne sprog'!$A:$I,4,FALSE),IF(Selection!$B$4=\"SE\",VLOOKUP($A122,'Style navne sprog'!$A:$I,3,FALSE),IF(Selection!$B$4=\"NO\",VLOOKUP($A122,'Style navne sprog'!$A:$I,5,FALSE),IF(Selection!$B$4=\"PL\",VLOOKUP($A122,'Style navne sprog'!$A:$I,7,FALSE)))))))","v":"Fleece bolero | unisex"},{"$f":"IF(Master!C122<>\"\",Master!C122*Selection!$B$3,\"\")","v":62.1},{"$f":"IF(Master!D122<>\"\",Master!D122*Selection!$B$3,\"\")","v":""},"",{"$f":"IF(Master!F122<>\"\",Master!F122*Selection!$B$3,\"\")","v":""},{"$f":"IF(Factor!#REF!<>\"\",Factor!#REF!*Selection!$B$3,\"\")","v":{"$error":"#REF!"}}]
["0811",{"$f":"IF(Selection!$B$4=\"DK\",VLOOKUP($A123,'Style navne sprog'!$A:$I,6,FALSE),IF(Selection!$B$4=\"DE\",VLOOKUP($A123,'Style navne sprog'!$A:$I,2,FALSE),IF(Selection!$B$4=\"GB\",VLOOKUP($A123,'Style navne sprog'!$A:$I,4,FALSE),IF(Selection!$B$4=\"SE\",VLOOKUP($A123,'Style navne sprog'!$A:$I,3,FALSE),IF(Selection!$B$4=\"NO\",VLOOKUP($A123,'Style navne sprog'!$A:$I,5,FALSE),IF(Selection!$B$4=\"PL\",VLOOKUP($A123,'Style navne sprog'!$A:$I,7,FALSE)))))))","v":"Active vest | microfleece"},{"$f":"IF(Master!C123<>\"\",Master!C123*Selection!$B$3,\"\")","v":70.900000000000006},{"$f":"IF(Master!D123<>\"\",Master!D123*Selection!$B$3,\"\")","v":""},"3XL-4XL",{"$f":"IF(Master!F123<>\"\",Master!F123*Selection!$B$3,\"\")","v":8},{"$f":"IF(Factor!#REF!<>\"\",Factor!#REF!*Selection!$B$3,\"\")","v":{"$error":"#REF!"}}]
["0812",{"$f":"IF(Selection!$B$4=\"DK\",VLOOKUP($A124,'Style navne sprog'!$A:$I,6,FALSE),IF(Selection!$B$4=\"DE\",VLOOKUP($A124,'Style navne sprog'!$A:$I,2,FALSE),IF(Selection!$B$4=\"GB\",VLOOKUP($A124,'Style navne sprog'!$A:$I,4,FALSE),IF(Selection!$B$4=\"SE\",VLOOKUP($A124,'Style navne sprog'!$A:$I,3,FALSE),IF(Selection!$B$4=\"NO\",VLOOKUP($A124,'Style navne sprog'!$A:$I,5,FALSE),IF(Selection!$B$4=\"PL\",VLOOKUP($A124,'Style navne sprog'!$A:$I,7,FALSE)))))))","v":"Active vest | microfleece | women"},{"$f":"IF(Master!C124<>\"\",Master!C124*Selection!$B$3,\"\")","v":70.900000000000006},{"$f":"IF(Master!D124<>\"\",Master!D124*Selection!$B$3,\"\")","v":""},"3XL",{"$f":"IF(Master!F124<>\"\",Master!F124*Selection!$B$3,\"\")","v":8},{"$f":"IF(Factor!#REF!<>\"\",Factor!#REF!*Selection!$B$3,\"\")","v":{"$error":"#REF!"}}]
["0826",{"$f":"IF(Selection!$B$4=\"DK\",VLOOKUP($A125,'Style navne sprog'!$A:$I,6,FALSE),IF(Selection!$B$4=\"DE\",VLOOKUP($A125,'Style navne sprog'!$A:$I,2,FALSE),IF(Selection!$B$4=\"GB\",VLOOKUP($A125,'Style navne sprog'!$A:$I,4,FALSE),IF(Selection!$B$4=\"SE\",VLOOKUP($A125,'Style navne sprog'!$A:$I,3,FALSE),IF(Selection!$B$4=\"NO\",VLOOKUP($A125,'Style navne sprog'!$A:$I,5,FALSE),IF(Selection!$B$4=\"PL\",VLOOKUP($A125,'Style navne sprog'!$A:$I,7,FALSE)))))))","v":"Fleece jacket | quilted"},{"$f":"IF(Master!C125<>\"\",Master!C125*Selection!$B$3,\"\")","v":158.4},{"$f":"IF(Master!D125<>\"\",Master!D125*Selection!$B$3,\"\")","v":""},"3XL-4XL",{"$f":"IF(Master!F125<>\"\",Master!F125*Selection!$B$3,\"\")","v":8},{"$f":"IF(Factor!#REF!<>\"\",Factor!#REF!*Selection!$B$3,\"\")","v":{"$error":"#REF!"}}]
["0827",{"$f":"IF(Selection!$B$4=\"DK\",VLOOKUP($A126,'Style navne sprog'!$A:$I,6,FALSE),IF(Selection!$B$4=\"DE\",VLOOKUP($A126,'Style navne sprog'!$A:$I,2,FALSE),IF(Selection!$B$4=\"GB\",VLOOKUP($A126,'Style navne sprog'!$A:$I,4,FALSE),IF(Selection!$B$4=\"SE\",VLOOKUP($A126,'Style navne sprog'!$A:$I,3,FALSE),IF(Selection!$B$4=\"NO\",VLOOKUP($A126,'Style navne sprog'!$A:$I,5,FALSE),IF(Selection!$B$4=\"PL\",VLOOKUP($A126,'Style navne sprog'!$A:$I,7,FALSE)))))))","v":"Fleece jacket | quilted | women"},{"$f":"IF(Master!C126<>\"\",Master!C126*Selection!$B$3,\"\")","v":158.4},{"$f":"IF(Master!D126<>\"\",Master!D126*Selection!$B$3,\"\")","v":""},"4XL",{"$f":"IF(Master!F126<>\"\",Master!F126*Selection!$B$3,\"\")","v":8},{"$f":"IF(Factor!#REF!<>\"\",Factor!#REF!*Selection!$B$3,\"\")","v":{"$error":"#REF!"}}]
["0828",{"$f":"IF(Selection!$B$4=\"DK\",VLOOKUP($A127,'Style navne sprog'!$A:$I,6,FALSE),IF(Selection!$B$4=\"DE\",VLOOKUP($A127,'Style navne sprog'!$A:$I,2,FALSE),IF(Selection!$B$4=\"GB\",VLOOKUP($A127,'Style navne sprog'!$A:$I,4,FALSE),IF(Selection!$B$4=\"SE\",VLOOKUP($A127,'Style navne sprog'!$A:$I,3,FALSE),IF(Selection!$B$4=\"NO\",VLOOKUP($A127,'Style navne sprog'!$A:$I,5,FALSE),IF(Selection!$B$4=\"PL\",VLOOKUP($A127,'Style navne sprog'!$A:$I,7,FALSE)))))))","v":"Pile fleece jacket"},{"$f":"IF(Master!C127<>\"\",Master!C127*Selection!$B$3,\"\")","v":158.10000000000002},{"$f":"IF(Master!D127<>\"\",Master!D127*Selection!$B$3,\"\")","v":""},"3XL",{"$f":"IF(Master!F127<>\"\",Master!F127*Selection!$B$3,\"\")","v":8},{"$f":"IF(Factor!#REF!<>\"\",Factor!#REF!*Selection!$B$3,\"\")","v":{"$error":"#REF!"}}]
["0829",{"$f":"IF(Selection!$B$4=\"DK\",VLOOKUP($A128,'Style navne sprog'!$A:$I,6,FALSE),IF(Selection!$B$4=\"DE\",VLOOKUP($A128,'Style navne sprog'!$A:$I,2,FALSE),IF(Selection!$B$4=\"GB\",VLOOKUP($A128,'Style navne sprog'!$A:$I,4,FALSE),IF(Selection!$B$4=\"SE\",VLOOKUP($A128,'Style navne sprog'!$A:$I,3,FALSE),IF(Selection!$B$4=\"NO\",VLOOKUP($A128,'Style navne sprog'!$A:$I,5,FALSE),IF(Selection!$B$4=\"PL\",VLOOKUP($A128,'Style navne sprog'!$A:$I,7,FALSE)))))))","v":"Pile fleece jacket I women"},{"$f":"IF(Master!C128<>\"\",Master!C128*Selection!$B$3,\"\")","v":158.10000000000002},{"$f":"IF(Master!D128<>\"\",Master!D128*Selection!$B$3,\"\")","v":""},"3XL",{"$f":"IF(Master!F128<>\"\",Master!F128*Selection!$B$3,\"\")","v":8},{"$f":"IF(Factor!#REF!<>\"\",Factor!#REF!*Selection!$B$3,\"\")","v":{"$error":"#REF!"}}]
["0840",{"$f":"IF(Selection!$B$4=\"DK\",VLOOKUP($A129,'Style navne sprog'!$A:$I,6,FALSE),IF(Selection!$B$4=\"DE\",VLOOKUP($A129,'Style navne sprog'!$A:$I,2,FALSE),IF(Selection!$B$4=\"GB\",VLOOKUP($A129,'Style navne sprog'!$A:$I,4,FALSE),IF(Selection!$B$4=\"SE\",VLOOKUP($A129,'Style navne sprog'!$A:$I,3,FALSE),IF(Selection!$B$4=\"NO\",VLOOKUP($A129,'Style navne sprog'!$A:$I,5,FALSE),IF(Selection!$B$4=\"PL\",VLOOKUP($A129,'Style navne sprog'!$A:$I,7,FALSE)))))))","v":"Cardigan | stretch comfort"},{"$f":"IF(Master!C129<>\"\",Master!C129*Selection!$B$3,\"\")","v":160.80000000000001},{"$f":"IF(Master!D129<>\"\",Master!D129*Selection!$B$3,\"\")","v":""},"3XL-4XL",{"$f":"IF(Master!F129<>\"\",Master!F129*Selection!$B$3,\"\")","v":8},{"$f":"IF(Factor!#REF!<>\"\",Factor!#REF!*Selection!$B$3,\"\")","v":{"$error":"#REF!"}}]
["0841",{"$f":"IF(Selection!$B$4=\"DK\",VLOOKUP($A130,'Style navne sprog'!$A:$I,6,FALSE),IF(Selection!$B$4=\"DE\",VLOOKUP($A130,'Style navne sprog'!$A:$I,2,FALSE),IF(Selection!$B$4=\"GB\",VLOOKUP($A130,'Style navne sprog'!$A:$I,4,FALSE),IF(Selection!$B$4=\"SE\",VLOOKUP($A130,'Style navne sprog'!$A:$I,3,FALSE),IF(Selection!$B$4=\"NO\",VLOOKUP($A130,'Style navne sprog'!$A:$I,5,FALSE),IF(Selection!$B$4=\"PL\",VLOOKUP($A130,'Style navne sprog'!$A:$I,7,FALSE)))))))","v":"Cardigan | stretch comfort | women"},{"$f":"IF(Master!C130<>\"\",Master!C130*Selection!$B$3,\"\")","v":160.80000000000001},{"$f":"IF(Master!D130<>\"\",Master!D130*Selection!$B$3,\"\")","v":""},"3XL-4XL",{"$f":"IF(Master!F130<>\"\",Master!F130*Selection!$B$3,\"\")","v":8},{"$f":"IF(Factor!#REF!<>\"\",Factor!#REF!*Selection!$B$3,\"\")","v":{"$error":"#REF!"}}]
["0847",{"$f":"IF(Selection!$B$4=\"DK\",VLOOKUP($A131,'Style navne sprog'!$A:$I,6,FALSE),IF(Selection!$B$4=\"DE\",VLOOKUP($A131,'Style navne sprog'!$A:$I,2,FALSE),IF(Selection!$B$4=\"GB\",VLOOKUP($A131,'Style navne sprog'!$A:$I,4,FALSE),IF(Selection!$B$4=\"SE\",VLOOKUP($A131,'Style navne sprog'!$A:$I,3,FALSE),IF(Selection!$B$4=\"NO\",VLOOKUP($A131,'Style navne sprog'!$A:$I,5,FALSE),IF(Selection!$B$4=\"PL\",VLOOKUP($A131,'Style navne sprog'!$A:$I,7,FALSE)))))))","v":"Zip-n-Mix fleece | melange"},{"$f":"IF(Master!C131<>\"\",Master!C131*Selection!$B$3,\"\")","v":141.70000000000002},{"$f":"IF(Master!D131<>\"\",Master!D131*Selection!$B$3,\"\")","v":""},"3XL-4XL",{"$f":"IF(Master!F131<>\"\",Master!F131*Selection!$B$3,\"\")","v":8},{"$f":"IF(Factor!#REF!<>\"\",Factor!#REF!*Selection!$B$3,\"\")","v":{"$error":"#REF!"}}]
["0848",{"$f":"IF(Selection!$B$4=\"DK\",VLOOKUP($A132,'Style navne sprog'!$A:$I,6,FALSE),IF(Selection!$B$4=\"DE\",VLOOKUP($A132,'Style navne sprog'!$A:$I,2,FALSE),IF(Selection!$B$4=\"GB\",VLOOKUP($A132,'Style navne sprog'!$A:$I,4,FALSE),IF(Selection!$B$4=\"SE\",VLOOKUP($A132,'Style navne sprog'!$A:$I,3,FALSE),IF(Selection!$B$4=\"NO\",VLOOKUP($A132,'Style navne sprog'!$A:$I,5,FALSE),IF(Selection!$B$4=\"PL\",VLOOKUP($A132,'Style navne sprog'!$A:$I,7,FALSE)))))))","v":"Zip-n-Mix fleece | melange | women"},{"$f":"IF(Master!C132<>\"\",Master!C132*Selection!$B$3,\"\")","v":141.70000000000002},{"$f":"IF(Master!D132<>\"\",Master!D132*Selection!$B$3,\"\")","v":""},"3XL",{"$f":"IF(Master!F132<>\"\",Master!F132*Selection!$B$3,\"\")","v":8},{"$f":"IF(Factor!#REF!<>\"\",Factor!#REF!*Selection!$B$3,\"\")","v":{"$error":"#REF!"}}]
["0850",{"$f":"IF(Selection!$B$4=\"DK\",VLOOKUP($A133,'Style navne sprog'!$A:$I,6,FALSE),IF(Selection!$B$4=\"DE\",VLOOKUP($A133,'Style navne sprog'!$A:$I,2,FALSE),IF(Selection!$B$4=\"GB\",VLOOKUP($A133,'Style navne sprog'!$A:$I,4,FALSE),IF(Selection!$B$4=\"SE\",VLOOKUP($A133,'Style navne sprog'!$A:$I,3,FALSE),IF(Selection!$B$4=\"NO\",VLOOKUP($A133,'Style navne sprog'!$A:$I,5,FALSE),IF(Selection!$B$4=\"PL\",VLOOKUP($A133,'Style navne sprog'!$A:$I,7,FALSE)))))))","v":"Cardigan | knit fleece"},{"$f":"IF(Master!C133<>\"\",Master!C133*Selection!$B$3,\"\")","v":163.20000000000002},{"$f":"IF(Master!D133<>\"\",Master!D133*Selection!$B$3,\"\")","v":""},"3XL",{"$f":"IF(Master!F133<>\"\",Master!F133*Selection!$B$3,\"\")","v":8},{"$f":"IF(Factor!#REF!<>\"\",Factor!#REF!*Selection!$B$3,\"\")","v":{"$error":"#REF!"}}]
["0851",{"$f":"IF(Selection!$B$4=\"DK\",VLOOKUP($A134,'Style navne sprog'!$A:$I,6,FALSE),IF(Selection!$B$4=\"DE\",VLOOKUP($A134,'Style navne sprog'!$A:$I,2,FALSE),IF(Selection!$B$4=\"GB\",VLOOKUP($A134,'Style navne sprog'!$A:$I,4,FALSE),IF(Selection!$B$4=\"SE\",VLOOKUP($A134,'Style navne sprog'!$A:$I,3,FALSE),IF(Selection!$B$4=\"NO\",VLOOKUP($A134,'Style navne sprog'!$A:$I,5,FALSE),IF(Selection!$B$4=\"PL\",VLOOKUP($A134,'Style navne sprog'!$A:$I,7,FALSE)))))))","v":"Cardigan | knit fleece | women"},{"$f":"IF(Master!C134<>\"\",Master!C134*Selection!$B$3,\"\")","v":163.20000000000002},{"$f":"IF(Master!D134<>\"\",Master!D134*Selection!$B$3,\"\")","v":""},"3XL",{"$f":"IF(Master!F134<>\"\",Master!F134*Selection!$B$3,\"\")","v":8},{"$f":"IF(Factor!#REF!<>\"\",Factor!#REF!*Selection!$B$3,\"\")","v":{"$error":"#REF!"}}]
[]
[{"$f":"IF(Selection!$B$4=\"PL\",\"ODZIEZ WIERZCHNIA\",IF(Selection!$B$4=\"SE\",\"YTTERKLÄDER\",IF(Selection!$B$4=\"GB\",\"OUTERWEAR\",IF(Selection!$B$4=\"DE\",\"JACKEN & WESTEN\",IF(Selection!$B$4=\"NO\",\"YTTERTØY\",\"OVERTØJ\")))))","v":"OUTERWEAR"}]
["0712",{"$f":"IF(Selection!$B$4=\"DK\",VLOOKUP($A137,'Style navne sprog'!$A:$I,6,FALSE),IF(Selection!$B$4=\"DE\",VLOOKUP($A137,'Style navne sprog'!$A:$I,2,FALSE),IF(Selection!$B$4=\"GB\",VLOOKUP($A137,'Style navne sprog'!$A:$I,4,FALSE),IF(Selection!$B$4=\"SE\",VLOOKUP($A137,'Style navne sprog'!$A:$I,3,FALSE),IF(Selection!$B$4=\"NO\",VLOOKUP($A137,'Style navne sprog'!$A:$I,5,FALSE),IF(Selection!$B$4=\"PL\",VLOOKUP($A137,'Style navne sprog'!$A:$I,7,FALSE)))))))","v":"Zip-n-Mix shell Jacket"},{"$f":"IF(Master!C137<>\"\",Master!C137*Selection!$B$3,\"\")","v":321.90000000000003},{"$f":"IF(Master!D137<>\"\",Master!D137*Selection!$B$3,\"\")","v":""},"3XL-6XL",{"$f":"IF(Master!F137<>\"\",Master!F137*Selection!$B$3,\"\")","v":8},{"$f":"IF(Factor!#REF!<>\"\",Factor!#REF!*Selection!$B$3,\"\")","v":{"$error":"#REF!"}}]
["0713",{"$f":"IF(Selection!$B$4=\"DK\",VLOOKUP($A138,'Style navne sprog'!$A:$I,6,FALSE),IF(Selection!$B$4=\"DE\",VLOOKUP($A138,'Style navne sprog'!$A:$I,2,FALSE),IF(Selection!$B$4=\"GB\",VLOOKUP($A138,'Style navne sprog'!$A:$I,4,FALSE),IF(Selection!$B$4=\"SE\",VLOOKUP($A138,'Style navne sprog'!$A:$I,3,FALSE),IF(Selection!$B$4=\"NO\",VLOOKUP($A138,'Style navne sprog'!$A:$I,5,FALSE),IF(Selection!$B$4=\"PL\",VLOOKUP($A138,'Style navne sprog'!$A:$I,7,FALSE)))))))","v":"Zip-n-Mix shell jacket | women"},{"$f":"IF(Master!C138<>\"\",Master!C138*Selection!$B$3,\"\")","v":321.90000000000003},{"$f":"IF(Master!D138<>\"\",Master!D138*Selection!$B$3,\"\")","v":""},"3XL-6XL",{"$f":"IF(Master!F138<>\"\",Master!F138*Selection!$B$3,\"\")","v":8},{"$f":"IF(Factor!#REF!<>\"\",Factor!#REF!*Selection!$B$3,\"\")","v":{"$error":"#REF!"}}]
["0720",{"$f":"IF(Selection!$B$4=\"DK\",VLOOKUP($A139,'Style navne sprog'!$A:$I,6,FALSE),IF(Selection!$B$4=\"DE\",VLOOKUP($A139,'Style navne sprog'!$A:$I,2,FALSE),IF(Selection!$B$4=\"GB\",VLOOKUP($A139,'Style navne sprog'!$A:$I,4,FALSE),IF(Selection!$B$4=\"SE\",VLOOKUP($A139,'Style navne sprog'!$A:$I,3,FALSE),IF(Selection!$B$4=\"NO\",VLOOKUP($A139,'Style navne sprog'!$A:$I,5,FALSE),IF(Selection!$B$4=\"PL\",VLOOKUP($A139,'Style navne sprog'!$A:$I,7,FALSE)))))))","v":"Hybrid jacket"},{"$f":"IF(Master!C139<>\"\",Master!C139*Selection!$B$3,\"\")","v":187.70000000000002},{"$f":"IF(Master!D139<>\"\",Master!D139*Selection!$B$3,\"\")","v":""},"3XL-4XL",{"$f":"IF(Master!F139<>\"\",Master!F139*Selection!$B$3,\"\")","v":8},{"$f":"IF(Factor!#REF!<>\"\",Factor!#REF!*Selection!$B$3,\"\")","v":{"$error":"#REF!"}}]
["0721",{"$f":"IF(Selection!$B$4=\"DK\",VLOOKUP($A140,'Style navne sprog'!$A:$I,6,FALSE),IF(Selection!$B$4=\"DE\",VLOOKUP($A140,'Style navne sprog'!$A:$I,2,FALSE),IF(Selection!$B$4=\"GB\",VLOOKUP($A140,'Style navne sprog'!$A:$I,4,FALSE),IF(Selection!$B$4=\"SE\",VLOOKUP($A140,'Style navne sprog'!$A:$I,3,FALSE),IF(Selection!$B$4=\"NO\",VLOOKUP($A140,'Style navne sprog'!$A:$I,5,FALSE),IF(Selection!$B$4=\"PL\",VLOOKUP($A140,'Style navne sprog'!$A:$I,7,FALSE)))))))","v":"Hybrid jacket | women"},{"$f":"IF(Master!C140<>\"\",Master!C140*Selection!$B$3,\"\")","v":187.70000000000002},{"$f":"IF(Master!D140<>\"\",Master!D140*Selection!$B$3,\"\")","v":""},"3XL-4XL",{"$f":"IF(Master!F140<>\"\",Master!F140*Selection!$B$3,\"\")","v":8},{"$f":"IF(Factor!#REF!<>\"\",Factor!#REF!*Selection!$B$3,\"\")","v":{"$error":"#REF!"}}]
["0780",{"$f":"IF(Selection!$B$4=\"DK\",VLOOKUP($A141,'Style navne sprog'!$A:$I,6,FALSE),IF(Selection!$B$4=\"DE\",VLOOKUP($A141,'Style navne sprog'!$A:$I,2,FALSE),IF(Selection!$B$4=\"GB\",VLOOKUP($A141,'Style navne sprog'!$A:$I,4,FALSE),IF(Selection!$B$4=\"SE\",VLOOKUP($A141,'Style navne sprog'!$A:$I,3,FALSE),IF(Selection!$B$4=\"NO\",VLOOKUP($A141,'Style navne sprog'!$A:$I,5,FALSE),IF(Selection!$B$4=\"PL\",VLOOKUP($A141,'Style navne sprog'!$A:$I,7,FALSE)))))))","v":"Zip-n-Mix jacket | hybrid"},{"$f":"IF(Master!C141<>\"\",Master!C141*Selection!$B$3,\"\")","v":241.3},{"$f":"IF(Master!D141<>\"\",Master!D141*Selection!$B$3,\"\")","v":""},"3XL-6XL",{"$f":"IF(Master!F141<>\"\",Master!F141*Selection!$B$3,\"\")","v":8},{"$f":"IF(Factor!#REF!<>\"\",Factor!#REF!*Selection!$B$3,\"\")","v":{"$error":"#REF!"}}]
["0781",{"$f":"IF(Selection!$B$4=\"DK\",VLOOKUP($A142,'Style navne sprog'!$A:$I,6,FALSE),IF(Selection!$B$4=\"DE\",VLOOKUP($A142,'Style navne sprog'!$A:$I,2,FALSE),IF(Selection!$B$4=\"GB\",VLOOKUP($A142,'Style navne sprog'!$A:$I,4,FALSE),IF(Selection!$B$4=\"SE\",VLOOKUP($A142,'Style navne sprog'!$A:$I,3,FALSE),IF(Selection!$B$4=\"NO\",VLOOKUP($A142,'Style navne sprog'!$A:$I,5,FALSE),IF(Selection!$B$4=\"PL\",VLOOKUP($A142,'Style navne sprog'!$A:$I,7,FALSE)))))))","v":"Zip-n-Mix jacket | hybrid | women"},{"$f":"IF(Master!C142<>\"\",Master!C142*Selection!$B$3,\"\")","v":241.3},{"$f":"IF(Master!D142<>\"\",Master!D142*Selection!$B$3,\"\")","v":""},"3XL-6XL",{"$f":"IF(Master!F142<>\"\",Master!F142*Selection!$B$3,\"\")","v":8},{"$f":"IF(Factor!#REF!<>\"\",Factor!#REF!*Selection!$B$3,\"\")","v":{"$error":"#REF!"}}]
["0824",{"$f":"IF(Selection!$B$4=\"DK\",VLOOKUP($A143,'Style navne sprog'!$A:$I,6,FALSE),IF(Selection!$B$4=\"DE\",VLOOKUP($A143,'Style navne sprog'!$A:$I,2,FALSE),IF(Selection!$B$4=\"GB\",VLOOKUP($A143,'Style navne sprog'!$A:$I,4,FALSE),IF(Selection!$B$4=\"SE\",VLOOKUP($A143,'Style navne sprog'!$A:$I,3,FALSE),IF(Selection!$B$4=\"NO\",VLOOKUP($A143,'Style navne sprog'!$A:$I,5,FALSE),IF(Selection!$B$4=\"PL\",VLOOKUP($A143,'Style navne sprog'!$A:$I,7,FALSE)))))))","v":"Soft shell vest | functional"},{"$f":"IF(Master!C143<>\"\",Master!C143*Selection!$B$3,\"\")","v":123.2},{"$f":"IF(Master!D143<>\"\",Master!D143*Selection!$B$3,\"\")","v":""},"3XL-6XL",{"$f":"IF(Master!F143<>\"\",Master!F143*Selection!$B$3,\"\")","v":8},{"$f":"IF(Factor!#REF!<>\"\",Factor!#REF!*Selection!$B$3,\"\")","v":{"$error":"#REF!"}}]
["0825",{"$f":"IF(Selection!$B$4=\"DK\",VLOOKUP($A144,'Style navne sprog'!$A:$I,6,FALSE),IF(Selection!$B$4=\"DE\",VLOOKUP($A144,'Style navne sprog'!$A:$I,2,FALSE),IF(Selection!$B$4=\"GB\",VLOOKUP($A144,'Style navne sprog'!$A:$I,4,FALSE),IF(Selection!$B$4=\"SE\",VLOOKUP($A144,'Style navne sprog'!$A:$I,3,FALSE),IF(Selection!$B$4=\"NO\",VLOOKUP($A144,'Style navne sprog'!$A:$I,5,FALSE),IF(Selection!$B$4=\"PL\",VLOOKUP($A144,'Style navne sprog'!$A:$I,7,FALSE)))))))","v":"Soft shell vest | functional | women"},{"$f":"IF(Master!C144<>\"\",Master!C144*Selection!$B$3,\"\")","v":123.2},{"$f":"IF(Master!D144<>\"\",Master!D144*Selection!$B$3,\"\")","v":""},"3XL",{"$f":"IF(Master!F144<>\"\",Master!F144*Selection!$B$3,\"\")","v":8},{"$f":"IF(Factor!#REF!<>\"\",Factor!#REF!*Selection!$B$3,\"\")","v":{"$error":"#REF!"}}]
["0830",{"$f":"IF(Selection!$B$4=\"DK\",VLOOKUP($A145,'Style navne sprog'!$A:$I,6,FALSE),IF(Selection!$B$4=\"DE\",VLOOKUP($A145,'Style navne sprog'!$A:$I,2,FALSE),IF(Selection!$B$4=\"GB\",VLOOKUP($A145,'Style navne sprog'!$A:$I,4,FALSE),IF(Selection!$B$4=\"SE\",VLOOKUP($A145,'Style navne sprog'!$A:$I,3,FALSE),IF(Selection!$B$4=\"NO\",VLOOKUP($A145,'Style navne sprog'!$A:$I,5,FALSE),IF(Selection!$B$4=\"PL\",VLOOKUP($A145,'Style navne sprog'!$A:$I,7,FALSE)))))))","v":"Rain jacket | performance"},{"$f":"IF(Master!C145<>\"\",Master!C145*Selection!$B$3,\"\")","v":158.10000000000002},{"$f":"IF(Master!D145<>\"\",Master!D145*Selection!$B$3,\"\")","v":""},"3XL",{"$f":"IF(Master!F145<>\"\",Master!F145*Selection!$B$3,\"\")","v":8},{"$f":"IF(Factor!#REF!<>\"\",Factor!#REF!*Selection!$B$3,\"\")","v":{"$error":"#REF!"}}]
["0831",{"$f":"IF(Selection!$B$4=\"DK\",VLOOKUP($A146,'Style navne sprog'!$A:$I,6,FALSE),IF(Selection!$B$4=\"DE\",VLOOKUP($A146,'Style navne sprog'!$A:$I,2,FALSE),IF(Selection!$B$4=\"GB\",VLOOKUP($A146,'Style navne sprog'!$A:$I,4,FALSE),IF(Selection!$B$4=\"SE\",VLOOKUP($A146,'Style navne sprog'!$A:$I,3,FALSE),IF(Selection!$B$4=\"NO\",VLOOKUP($A146,'Style navne sprog'!$A:$I,5,FALSE),IF(Selection!$B$4=\"PL\",VLOOKUP($A146,'Style navne sprog'!$A:$I,7,FALSE)))))))","v":"Rain jacket | performance | women"},{"$f":"IF(Master!C146<>\"\",Master!C146*Selection!$B$3,\"\")","v":158.10000000000002},{"$f":"IF(Master!D146<>\"\",Master!D146*Selection!$B$3,\"\")","v":""},"3XL",{"$f":"IF(Master!F146<>\"\",Master!F146*Selection!$B$3,\"\")","v":8},{"$f":"IF(Factor!#REF!<>\"\",Factor!#REF!*Selection!$B$3,\"\")","v":{"$error":"#REF!"}}]
["0836",{"$f":"IF(Selection!$B$4=\"DK\",VLOOKUP($A147,'Style navne sprog'!$A:$I,6,FALSE),IF(Selection!$B$4=\"DE\",VLOOKUP($A147,'Style navne sprog'!$A:$I,2,FALSE),IF(Selection!$B$4=\"GB\",VLOOKUP($A147,'Style navne sprog'!$A:$I,4,FALSE),IF(Selection!$B$4=\"SE\",VLOOKUP($A147,'Style navne sprog'!$A:$I,3,FALSE),IF(Selection!$B$4=\"NO\",VLOOKUP($A147,'Style navne sprog'!$A:$I,5,FALSE),IF(Selection!$B$4=\"PL\",VLOOKUP($A147,'Style navne sprog'!$A:$I,7,FALSE)))))))","v":"Soft shell jacket | light"},{"$f":"IF(Master!C147<>\"\",Master!C147*Selection!$B$3,\"\")","v":174.20000000000002},{"$f":"IF(Master!D147<>\"\",Master!D147*Selection!$B$3,\"\")","v":""},"3XL-6XL",{"$f":"IF(Master!F147<>\"\",Master!F147*Selection!$B$3,\"\")","v":8},{"$f":"IF(Factor!#REF!<>\"\",Factor!#REF!*Selection!$B$3,\"\")","v":{"$error":"#REF!"}}]
["0837",{"$f":"IF(Selection!$B$4=\"DK\",VLOOKUP($A148,'Style navne sprog'!$A:$I,6,FALSE),IF(Selection!$B$4=\"DE\",VLOOKUP($A148,'Style navne sprog'!$A:$I,2,FALSE),IF(Selection!$B$4=\"GB\",VLOOKUP($A148,'Style navne sprog'!$A:$I,4,FALSE),IF(Selection!$B$4=\"SE\",VLOOKUP($A148,'Style navne sprog'!$A:$I,3,FALSE),IF(Selection!$B$4=\"NO\",VLOOKUP($A148,'Style navne sprog'!$A:$I,5,FALSE),IF(Selection!$B$4=\"PL\",VLOOKUP($A148,'Style navne sprog'!$A:$I,7,FALSE)))))))","v":"Soft shell jacket | light | women"},{"$f":"IF(Master!C148<>\"\",Master!C148*Selection!$B$3,\"\")","v":174.20000000000002},{"$f":"IF(Master!D148<>\"\",Master!D148*Selection!$B$3,\"\")","v":""},"3XL",{"$f":"IF(Master!F148<>\"\",Master!F148*Selection!$B$3,\"\")","v":8},{"$f":"IF(Factor!#REF!<>\"\",Factor!#REF!*Selection!$B$3,\"\")","v":{"$error":"#REF!"}}]
["0842",{"$f":"IF(Selection!$B$4=\"DK\",VLOOKUP($A149,'Style navne sprog'!$A:$I,6,FALSE),IF(Selection!$B$4=\"DE\",VLOOKUP($A149,'Style navne sprog'!$A:$I,2,FALSE),IF(Selection!$B$4=\"GB\",VLOOKUP($A149,'Style navne sprog'!$A:$I,4,FALSE),IF(Selection!$B$4=\"SE\",VLOOKUP($A149,'Style navne sprog'!$A:$I,3,FALSE),IF(Selection!$B$4=\"NO\",VLOOKUP($A149,'Style navne sprog'!$A:$I,5,FALSE),IF(Selection!$B$4=\"PL\",VLOOKUP($A149,'Style navne sprog'!$A:$I,7,FALSE)))))))","v":"Hooded winter jacket"},{"$f":"IF(Master!C149<>\"\",Master!C149*Selection!$B$3,\"\")","v":321.90000000000003},{"$f":"IF(Master!D149<>\"\",Master!D149*Selection!$B$3,\"\")","v":""},"3XL-4XL",{"$f":"IF(Master!F149<>\"\",Master!F149*Selection!$B$3,\"\")","v":8},{"$f":"IF(Factor!#REF!<>\"\",Factor!#REF!*Selection!$B$3,\"\")","v":{"$error":"#REF!"}}]
["0843",{"$f":"IF(Selection!$B$4=\"DK\",VLOOKUP($A150,'Style navne sprog'!$A:$I,6,FALSE),IF(Selection!$B$4=\"DE\",VLOOKUP($A150,'Style navne sprog'!$A:$I,2,FALSE),IF(Selection!$B$4=\"GB\",VLOOKUP($A150,'Style navne sprog'!$A:$I,4,FALSE),IF(Selection!$B$4=\"SE\",VLOOKUP($A150,'Style navne sprog'!$A:$I,3,FALSE),IF(Selection!$B$4=\"NO\",VLOOKUP($A150,'Style navne sprog'!$A:$I,5,FALSE),IF(Selection!$B$4=\"PL\",VLOOKUP($A150,'Style navne sprog'!$A:$I,7,FALSE)))))))","v":"Hooded winter jacket | women"},{"$f":"IF(Master!C150<>\"\",Master!C150*Selection!$B$3,\"\")","v":321.90000000000003},{"$f":"IF(Master!D150<>\"\",Master!D150*Selection!$B$3,\"\")","v":""},"3XL-4XL",{"$f":"IF(Master!F150<>\"\",Master!F150*Selection!$B$3,\"\")","v":8},{"$f":"IF(Factor!#REF!<>\"\",Factor!#REF!*Selection!$B$3,\"\")","v":{"$error":"#REF!"}}]
["0854",{"$f":"IF(Selection!$B$4=\"DK\",VLOOKUP($A151,'Style navne sprog'!$A:$I,6,FALSE),IF(Selection!$B$4=\"DE\",VLOOKUP($A151,'Style navne sprog'!$A:$I,2,FALSE),IF(Selection!$B$4=\"GB\",VLOOKUP($A151,'Style navne sprog'!$A:$I,4,FALSE),IF(Selection!$B$4=\"SE\",VLOOKUP($A151,'Style navne sprog'!$A:$I,3,FALSE),IF(Selection!$B$4=\"NO\",VLOOKUP($A151,'Style navne sprog'!$A:$I,5,FALSE),IF(Selection!$B$4=\"PL\",VLOOKUP($A151,'Style navne sprog'!$A:$I,7,FALSE)))))))","v":"CORE soft shell jacket"},{"$f":"IF(Master!C151<>\"\",Master!C151*Selection!$B$3,\"\")","v":131.30000000000001},{"$f":"IF(Master!D151<>\"\",Master!D151*Selection!$B$3,\"\")","v":""},"3XL-6XL",{"$f":"IF(Master!F151<>\"\",Master!F151*Selection!$B$3,\"\")","v":8},{"$f":"IF(Factor!#REF!<>\"\",Factor!#REF!*Selection!$B$3,\"\")","v":{"$error":"#REF!"}}]
["0856",{"$f":"IF(Selection!$B$4=\"DK\",VLOOKUP($A152,'Style navne sprog'!$A:$I,6,FALSE),IF(Selection!$B$4=\"DE\",VLOOKUP($A152,'Style navne sprog'!$A:$I,2,FALSE),IF(Selection!$B$4=\"GB\",VLOOKUP($A152,'Style navne sprog'!$A:$I,4,FALSE),IF(Selection!$B$4=\"SE\",VLOOKUP($A152,'Style navne sprog'!$A:$I,3,FALSE),IF(Selection!$B$4=\"NO\",VLOOKUP($A152,'Style navne sprog'!$A:$I,5,FALSE),IF(Selection!$B$4=\"PL\",VLOOKUP($A152,'Style navne sprog'!$A:$I,7,FALSE)))))))","v":"CORE soft shell jacket| women"},{"$f":"IF(Master!C152<>\"\",Master!C152*Selection!$B$3,\"\")","v":131.30000000000001},{"$f":"IF(Master!D152<>\"\",Master!D152*Selection!$B$3,\"\")","v":""},"3XL",{"$f":"IF(Master!F152<>\"\",Master!F152*Selection!$B$3,\"\")","v":8},{"$f":"IF(Factor!#REF!<>\"\",Factor!#REF!*Selection!$B$3,\"\")","v":{"$error":"#REF!"}}]
["0868",{"$f":"IF(Selection!$B$4=\"DK\",VLOOKUP($A153,'Style navne sprog'!$A:$I,6,FALSE),IF(Selection!$B$4=\"DE\",VLOOKUP($A153,'Style navne sprog'!$A:$I,2,FALSE),IF(Selection!$B$4=\"GB\",VLOOKUP($A153,'Style navne sprog'!$A:$I,4,FALSE),IF(Selection!$B$4=\"SE\",VLOOKUP($A153,'Style navne sprog'!$A:$I,3,FALSE),IF(Selection!$B$4=\"NO\",VLOOKUP($A153,'Style navne sprog'!$A:$I,5,FALSE),IF(Selection!$B$4=\"PL\",VLOOKUP($A153,'Style navne sprog'!$A:$I,7,FALSE)))))))","v":"Soft shell jacket | performance"},{"$f":"IF(Master!C153<>\"\",Master!C153*Selection!$B$3,\"\")","v":142},{"$f":"IF(Master!D153<>\"\",Master!D153*Selection!$B$3,\"\")","v":""},"3XL-4XL",{"$f":"IF(Master!F153<>\"\",Master!F153*Selection!$B$3,\"\")","v":8},{"$f":"IF(Factor!#REF!<>\"\",Factor!#REF!*Selection!$B$3,\"\")","v":{"$error":"#REF!"}}]
["0869",{"$f":"IF(Selection!$B$4=\"DK\",VLOOKUP($A154,'Style navne sprog'!$A:$I,6,FALSE),IF(Selection!$B$4=\"DE\",VLOOKUP($A154,'Style navne sprog'!$A:$I,2,FALSE),IF(Selection!$B$4=\"GB\",VLOOKUP($A154,'Style navne sprog'!$A:$I,4,FALSE),IF(Selection!$B$4=\"SE\",VLOOKUP($A154,'Style navne sprog'!$A:$I,3,FALSE),IF(Selection!$B$4=\"NO\",VLOOKUP($A154,'Style navne sprog'!$A:$I,5,FALSE),IF(Selection!$B$4=\"PL\",VLOOKUP($A154,'Style navne sprog'!$A:$I,7,FALSE)))))))","v":"Soft shell jacket | performance | women"},{"$f":"IF(Master!C154<>\"\",Master!C154*Selection!$B$3,\"\")","v":142},{"$f":"IF(Master!D154<>\"\",Master!D154*Selection!$B$3,\"\")","v":""},"3XL",{"$f":"IF(Master!F154<>\"\",Master!F154*Selection!$B$3,\"\")","v":8},{"$f":"IF(Factor!#REF!<>\"\",Factor!#REF!*Selection!$B$3,\"\")","v":{"$error":"#REF!"}}]
["0892",{"$f":"IF(Selection!$B$4=\"DK\",VLOOKUP($A155,'Style navne sprog'!$A:$I,6,FALSE),IF(Selection!$B$4=\"DE\",VLOOKUP($A155,'Style navne sprog'!$A:$I,2,FALSE),IF(Selection!$B$4=\"GB\",VLOOKUP($A155,'Style navne sprog'!$A:$I,4,FALSE),IF(Selection!$B$4=\"SE\",VLOOKUP($A155,'Style navne sprog'!$A:$I,3,FALSE),IF(Selection!$B$4=\"NO\",VLOOKUP($A155,'Style navne sprog'!$A:$I,5,FALSE),IF(Selection!$B$4=\"PL\",VLOOKUP($A155,'Style navne sprog'!$A:$I,7,FALSE)))))))","v":"Bodywarmer | stretch"},{"$f":"IF(Master!C155<>\"\",Master!C155*Selection!$B$3,\"\")","v":142},{"$f":"IF(Master!D155<>\"\",Master!D155*Selection!$B$3,\"\")","v":""},"3XL",{"$f":"IF(Master!F155<>\"\",Master!F155*Selection!$B$3,\"\")","v":8},{"$f":"IF(Factor!#REF!<>\"\",Factor!#REF!*Selection!$B$3,\"\")","v":{"$error":"#REF!"}}]
["0893",{"$f":"IF(Selection!$B$4=\"DK\",VLOOKUP($A156,'Style navne sprog'!$A:$I,6,FALSE),IF(Selection!$B$4=\"DE\",VLOOKUP($A156,'Style navne sprog'!$A:$I,2,FALSE),IF(Selection!$B$4=\"GB\",VLOOKUP($A156,'Style navne sprog'!$A:$I,4,FALSE),IF(Selection!$B$4=\"SE\",VLOOKUP($A156,'Style navne sprog'!$A:$I,3,FALSE),IF(Selection!$B$4=\"NO\",VLOOKUP($A156,'Style navne sprog'!$A:$I,5,FALSE),IF(Selection!$B$4=\"PL\",VLOOKUP($A156,'Style navne sprog'!$A:$I,7,FALSE)))))))","v":"Bodywarmer | stretch | women"},{"$f":"IF(Master!C156<>\"\",Master!C156*Selection!$B$3,\"\")","v":142},{"$f":"IF(Master!D156<>\"\",Master!D156*Selection!$B$3,\"\")","v":""},"3XL",{"$f":"IF(Master!F156<>\"\",Master!F156*Selection!$B$3,\"\")","v":8},{"$f":"IF(Factor!#REF!<>\"\",Factor!#REF!*Selection!$B$3,\"\")","v":{"$error":"#REF!"}}]
["0896",{"$f":"IF(Selection!$B$4=\"DK\",VLOOKUP($A157,'Style navne sprog'!$A:$I,6,FALSE),IF(Selection!$B$4=\"DE\",VLOOKUP($A157,'Style navne sprog'!$A:$I,2,FALSE),IF(Selection!$B$4=\"GB\",VLOOKUP($A157,'Style navne sprog'!$A:$I,4,FALSE),IF(Selection!$B$4=\"SE\",VLOOKUP($A157,'Style navne sprog'!$A:$I,3,FALSE),IF(Selection!$B$4=\"NO\",VLOOKUP($A157,'Style navne sprog'!$A:$I,5,FALSE),IF(Selection!$B$4=\"PL\",VLOOKUP($A157,'Style navne sprog'!$A:$I,7,FALSE)))))))","v":"Padded jacket | stretch"},{"$f":"IF(Master!C157<>\"\",Master!C157*Selection!$B$3,\"\")","v":163.5},{"$f":"IF(Master!D157<>\"\",Master!D157*Selection!$B$3,\"\")","v":""},"3XL",{"$f":"IF(Master!F157<>\"\",Master!F157*Selection!$B$3,\"\")","v":8},{"$f":"IF(Factor!#REF!<>\"\",Factor!#REF!*Selection!$B$3,\"\")","v":{"$error":"#REF!"}}]
["0897",{"$f":"IF(Selection!$B$4=\"DK\",VLOOKUP($A158,'Style navne sprog'!$A:$I,6,FALSE),IF(Selection!$B$4=\"DE\",VLOOKUP($A158,'Style navne sprog'!$A:$I,2,FALSE),IF(Selection!$B$4=\"GB\",VLOOKUP($A158,'Style navne sprog'!$A:$I,4,FALSE),IF(Selection!$B$4=\"SE\",VLOOKUP($A158,'Style navne sprog'!$A:$I,3,FALSE),IF(Selection!$B$4=\"NO\",VLOOKUP($A158,'Style navne sprog'!$A:$I,5,FALSE),IF(Selection!$B$4=\"PL\",VLOOKUP($A158,'Style navne sprog'!$A:$I,7,FALSE)))))))","v":"Padded jacket | stretch | women"},{"$f":"IF(Master!C158<>\"\",Master!C158*Selection!$B$3,\"\")","v":163.5},{"$f":"IF(Master!D158<>\"\",Master!D158*Selection!$B$3,\"\")","v":""},"3XL",{"$f":"IF(Master!F158<>\"\",Master!F158*Selection!$B$3,\"\")","v":8},{"$f":"IF(Factor!#REF!<>\"\",Factor!#REF!*Selection!$B$3,\"\")","v":{"$error":"#REF!"}}]
["0898",{"$f":"IF(Selection!$B$4=\"DK\",VLOOKUP($A159,'Style navne sprog'!$A:$I,6,FALSE),IF(Selection!$B$4=\"DE\",VLOOKUP($A159,'Style navne sprog'!$A:$I,2,FALSE),IF(Selection!$B$4=\"GB\",VLOOKUP($A159,'Style navne sprog'!$A:$I,4,FALSE),IF(Selection!$B$4=\"SE\",VLOOKUP($A159,'Style navne sprog'!$A:$I,3,FALSE),IF(Selection!$B$4=\"NO\",VLOOKUP($A159,'Style navne sprog'!$A:$I,5,FALSE),IF(Selection!$B$4=\"PL\",VLOOKUP($A159,'Style navne sprog'!$A:$I,7,FALSE)))))))","v":"Soft shell jacket | winter"},{"$f":"IF(Master!C159<>\"\",Master!C159*Selection!$B$3,\"\")","v":236},{"$f":"IF(Master!D159<>\"\",Master!D159*Selection!$B$3,\"\")","v":""},"3XL",{"$f":"IF(Master!F159<>\"\",Master!F159*Selection!$B$3,\"\")","v":8},{"$f":"IF(Factor!#REF!<>\"\",Factor!#REF!*Selection!$B$3,\"\")","v":{"$error":"#REF!"}}]
["0899",{"$f":"IF(Selection!$B$4=\"DK\",VLOOKUP($A160,'Style navne sprog'!$A:$I,6,FALSE),IF(Selection!$B$4=\"DE\",VLOOKUP($A160,'Style navne sprog'!$A:$I,2,FALSE),IF(Selection!$B$4=\"GB\",VLOOKUP($A160,'Style navne sprog'!$A:$I,4,FALSE),IF(Selection!$B$4=\"SE\",VLOOKUP($A160,'Style navne sprog'!$A:$I,3,FALSE),IF(Selection!$B$4=\"NO\",VLOOKUP($A160,'Style navne sprog'!$A:$I,5,FALSE),IF(Selection!$B$4=\"PL\",VLOOKUP($A160,'Style navne sprog'!$A:$I,7,FALSE)))))))","v":"Soft shell jacket | winter | women"},{"$f":"IF(Master!C160<>\"\",Master!C160*Selection!$B$3,\"\")","v":236},{"$f":"IF(Master!D160<>\"\",Master!D160*Selection!$B$3,\"\")","v":""},"3XL",{"$f":"IF(Master!F160<>\"\",Master!F160*Selection!$B$3,\"\")","v":8},{"$f":"IF(Factor!#REF!<>\"\",Factor!#REF!*Selection!$B$3,\"\")","v":{"$error":"#REF!"}}]
[]
[{"$f":"IF(Selection!$B$4=\"PL\",\"SPODNIE\",IF(Selection!$B$4=\"SE\",\"BYXOR\",IF(Selection!$B$4=\"GB\",\"TROUSERS\",IF(Selection!$B$4=\"DE\",\"HOSEN\",\"BUKSER\"))))","v":"TROUSERS"}]
["0661",{"$f":"IF(Selection!$B$4=\"DK\",VLOOKUP($A163,'Style navne sprog'!$A:$I,6,FALSE),IF(Selection!$B$4=\"DE\",VLOOKUP($A163,'Style navne sprog'!$A:$I,2,FALSE),IF(Selection!$B$4=\"GB\",VLOOKUP($A163,'Style navne sprog'!$A:$I,4,FALSE),IF(Selection!$B$4=\"SE\",VLOOKUP($A163,'Style navne sprog'!$A:$I,3,FALSE),IF(Selection!$B$4=\"NO\",VLOOKUP($A163,'Style navne sprog'!$A:$I,5,FALSE),IF(Selection!$B$4=\"PL\",VLOOKUP($A163,'Style navne sprog'!$A:$I,7,FALSE)))))))","v":"Classic sweatpants | unisex"},{"$f":"IF(Master!C163<>\"\",Master!C163*Selection!$B$3,\"\")","v":45.400000000000006},{"$f":"IF(Master!D163<>\"\",Master!D163*Selection!$B$3,\"\")","v":""},"3XL-4XL",{"$f":"IF(Master!F163<>\"\",Master!F163*Selection!$B$3,\"\")","v":5.4},{"$f":"IF(Factor!#REF!<>\"\",Factor!#REF!*Selection!$B$3,\"\")","v":{"$error":"#REF!"}}]
["0714",{"$f":"IF(Selection!$B$4=\"DK\",VLOOKUP($A164,'Style navne sprog'!$A:$I,6,FALSE),IF(Selection!$B$4=\"DE\",VLOOKUP($A164,'Style navne sprog'!$A:$I,2,FALSE),IF(Selection!$B$4=\"GB\",VLOOKUP($A164,'Style navne sprog'!$A:$I,4,FALSE),IF(Selection!$B$4=\"SE\",VLOOKUP($A164,'Style navne sprog'!$A:$I,3,FALSE),IF(Selection!$B$4=\"NO\",VLOOKUP($A164,'Style navne sprog'!$A:$I,5,FALSE),IF(Selection!$B$4=\"PL\",VLOOKUP($A164,'Style navne sprog'!$A:$I,7,FALSE)))))))","v":"Zip-n-Mix pants | unisex"},{"$f":"IF(Master!C164<>\"\",Master!C164*Selection!$B$3,\"\")","v":174.20000000000002},{"$f":"IF(Master!D164<>\"\",Master!D164*Selection!$B$3,\"\")","v":""},"3XL-6XL",{"$f":"IF(Master!F164<>\"\",Master!F164*Selection!$B$3,\"\")","v":5.4},{"$f":"IF(Factor!#REF!<>\"\",Factor!#REF!*Selection!$B$3,\"\")","v":{"$error":"#REF!"}}]
["0902",{"$f":"IF(Selection!$B$4=\"DK\",VLOOKUP($A165,'Style navne sprog'!$A:$I,6,FALSE),IF(Selection!$B$4=\"DE\",VLOOKUP($A165,'Style navne sprog'!$A:$I,2,FALSE),IF(Selection!$B$4=\"GB\",VLOOKUP($A165,'Style navne sprog'!$A:$I,4,FALSE),IF(Selection!$B$4=\"SE\",VLOOKUP($A165,'Style navne sprog'!$A:$I,3,FALSE),IF(Selection!$B$4=\"NO\",VLOOKUP($A165,'Style navne sprog'!$A:$I,5,FALSE),IF(Selection!$B$4=\"PL\",VLOOKUP($A165,'Style navne sprog'!$A:$I,7,FALSE)))))))","v":"Hybrid stretch pants"},{"$f":"IF(Master!C165<>\"\",Master!C165*Selection!$B$3,\"\")","v":187.10000000000002},{"$f":"IF(Master!D165<>\"\",Master!D165*Selection!$B$3,\"\")","v":""},"3XL-6XL",{"$f":"IF(Master!F165<>\"\",Master!F165*Selection!$B$3,\"\")","v":8},{"$f":"IF(Factor!#REF!<>\"\",Factor!#REF!*Selection!$B$3,\"\")","v":{"$error":"#REF!"}}]
["0903",{"$f":"IF(Selection!$B$4=\"DK\",VLOOKUP($A166,'Style navne sprog'!$A:$I,6,FALSE),IF(Selection!$B$4=\"DE\",VLOOKUP($A166,'Style navne sprog'!$A:$I,2,FALSE),IF(Selection!$B$4=\"GB\",VLOOKUP($A166,'Style navne sprog'!$A:$I,4,FALSE),IF(Selection!$B$4=\"SE\",VLOOKUP($A166,'Style navne sprog'!$A:$I,3,FALSE),IF(Selection!$B$4=\"NO\",VLOOKUP($A166,'Style navne sprog'!$A:$I,5,FALSE),IF(Selection!$B$4=\"PL\",VLOOKUP($A166,'Style navne sprog'!$A:$I,7,FALSE)))))))","v":"Hybrid stretch pants | women"},{"$f":"IF(Master!C166<>\"\",Master!C166*Selection!$B$3,\"\")","v":187.10000000000002},{"$f":"IF(Master!D166<>\"\",Master!D166*Selection!$B$3,\"\")","v":""},"3XL-6XL",{"$f":"IF(Master!F166<>\"\",Master!F166*Selection!$B$3,\"\")","v":8},{"$f":"IF(Factor!#REF!<>\"\",Factor!#REF!*Selection!$B$3,\"\")","v":{"$error":"#REF!"}}]
["0907",{"$f":"IF(Selection!$B$4=\"DK\",VLOOKUP($A167,'Style navne sprog'!$A:$I,6,FALSE),IF(Selection!$B$4=\"DE\",VLOOKUP($A167,'Style navne sprog'!$A:$I,2,FALSE),IF(Selection!$B$4=\"GB\",VLOOKUP($A167,'Style navne sprog'!$A:$I,4,FALSE),IF(Selection!$B$4=\"SE\",VLOOKUP($A167,'Style navne sprog'!$A:$I,3,FALSE),IF(Selection!$B$4=\"NO\",VLOOKUP($A167,'Style navne sprog'!$A:$I,5,FALSE),IF(Selection!$B$4=\"PL\",VLOOKUP($A167,'Style navne sprog'!$A:$I,7,FALSE)))))))","v":"Stretch pants | multifunctional | unisex"},{"$f":"IF(Master!C167<>\"\",Master!C167*Selection!$B$3,\"\")","v":140.1},{"$f":"IF(Master!D167<>\"\",Master!D167*Selection!$B$3,\"\")","v":""},"3XL-6XL",{"$f":"IF(Master!F167<>\"\",Master!F167*Selection!$B$3,\"\")","v":8},{"$f":"IF(Factor!#REF!<>\"\",Factor!#REF!*Selection!$B$3,\"\")","v":{"$error":"#REF!"}}]
["0910",{"$f":"IF(Selection!$B$4=\"DK\",VLOOKUP($A168,'Style navne sprog'!$A:$I,6,FALSE),IF(Selection!$B$4=\"DE\",VLOOKUP($A168,'Style navne sprog'!$A:$I,2,FALSE),IF(Selection!$B$4=\"GB\",VLOOKUP($A168,'Style navne sprog'!$A:$I,4,FALSE),IF(Selection!$B$4=\"SE\",VLOOKUP($A168,'Style navne sprog'!$A:$I,3,FALSE),IF(Selection!$B$4=\"NO\",VLOOKUP($A168,'Style navne sprog'!$A:$I,5,FALSE),IF(Selection!$B$4=\"PL\",VLOOKUP($A168,'Style navne sprog'!$A:$I,7,FALSE)))))))","v":"CORE stretch pants"},{"$f":"IF(Master!C168<>\"\",Master!C168*Selection!$B$3,\"\")","v":187.70000000000002},{"$f":"IF(Master!D168<>\"\",Master!D168*Selection!$B$3,\"\")","v":""},"3XL-4XL",{"$f":"IF(Master!F168<>\"\",Master!F168*Selection!$B$3,\"\")","v":8},{"$f":"IF(Factor!#REF!<>\"\",Factor!#REF!*Selection!$B$3,\"\")","v":{"$error":"#REF!"}}]
["0911",{"$f":"IF(Selection!$B$4=\"DK\",VLOOKUP($A169,'Style navne sprog'!$A:$I,6,FALSE),IF(Selection!$B$4=\"DE\",VLOOKUP($A169,'Style navne sprog'!$A:$I,2,FALSE),IF(Selection!$B$4=\"GB\",VLOOKUP($A169,'Style navne sprog'!$A:$I,4,FALSE),IF(Selection!$B$4=\"SE\",VLOOKUP($A169,'Style navne sprog'!$A:$I,3,FALSE),IF(Selection!$B$4=\"NO\",VLOOKUP($A169,'Style navne sprog'!$A:$I,5,FALSE),IF(Selection!$B$4=\"PL\",VLOOKUP($A169,'Style navne sprog'!$A:$I,7,FALSE)))))))","v":"CORE stretch pants | women"},{"$f":"IF(Master!C169<>\"\",Master!C169*Selection!$B$3,\"\")","v":187.70000000000002},{"$f":"IF(Master!D169<>\"\",Master!D169*Selection!$B$3,\"\")","v":""},"3XL-4XL",{"$f":"IF(Master!F169<>\"\",Master!F169*Selection!$B$3,\"\")","v":8},{"$f":"IF(Factor!#REF!<>\"\",Factor!#REF!*Selection!$B$3,\"\")","v":{"$error":"#REF!"}}]
["0912",{"$f":"IF(Selection!$B$4=\"DK\",VLOOKUP($A170,'Style navne sprog'!$A:$I,6,FALSE),IF(Selection!$B$4=\"DE\",VLOOKUP($A170,'Style navne sprog'!$A:$I,2,FALSE),IF(Selection!$B$4=\"GB\",VLOOKUP($A170,'Style navne sprog'!$A:$I,4,FALSE),IF(Selection!$B$4=\"SE\",VLOOKUP($A170,'Style navne sprog'!$A:$I,3,FALSE),IF(Selection!$B$4=\"NO\",VLOOKUP($A170,'Style navne sprog'!$A:$I,5,FALSE),IF(Selection!$B$4=\"PL\",VLOOKUP($A170,'Style navne sprog'!$A:$I,7,FALSE)))))))","v":"CORE stretch shorts"},{"$f":"IF(Master!C170<>\"\",Master!C170*Selection!$B$3,\"\")","v":168.9},"","3XL-4XL",{"$f":"IF(Master!F170<>\"\",Master!F170*Selection!$B$3,\"\")","v":8},""]
["0913",{"$f":"IF(Selection!$B$4=\"DK\",VLOOKUP($A171,'Style navne sprog'!$A:$I,6,FALSE),IF(Selection!$B$4=\"DE\",VLOOKUP($A171,'Style navne sprog'!$A:$I,2,FALSE),IF(Selection!$B$4=\"GB\",VLOOKUP($A171,'Style navne sprog'!$A:$I,4,FALSE),IF(Selection!$B$4=\"SE\",VLOOKUP($A171,'Style navne sprog'!$A:$I,3,FALSE),IF(Selection!$B$4=\"NO\",VLOOKUP($A171,'Style navne sprog'!$A:$I,5,FALSE),IF(Selection!$B$4=\"PL\",VLOOKUP($A171,'Style navne sprog'!$A:$I,7,FALSE)))))))","v":"CORE stretch shorts | women"},{"$f":"IF(Master!C171<>\"\",Master!C171*Selection!$B$3,\"\")","v":168.9},"","3XL-4XL",{"$f":"IF(Master!F171<>\"\",Master!F171*Selection!$B$3,\"\")","v":8},""]
["0914",{"$f":"IF(Selection!$B$4=\"DK\",VLOOKUP($A172,'Style navne sprog'!$A:$I,6,FALSE),IF(Selection!$B$4=\"DE\",VLOOKUP($A172,'Style navne sprog'!$A:$I,2,FALSE),IF(Selection!$B$4=\"GB\",VLOOKUP($A172,'Style navne sprog'!$A:$I,4,FALSE),IF(Selection!$B$4=\"SE\",VLOOKUP($A172,'Style navne sprog'!$A:$I,3,FALSE),IF(Selection!$B$4=\"NO\",VLOOKUP($A172,'Style navne sprog'!$A:$I,5,FALSE),IF(Selection!$B$4=\"PL\",VLOOKUP($A172,'Style navne sprog'!$A:$I,7,FALSE)))))))","v":"Cargo stretch pants | unisex"},{"$f":"IF(Master!C172<>\"\",Master!C172*Selection!$B$3,\"\")","v":187.70000000000002},{"$f":"IF(Master!D172<>\"\",Master!D172*Selection!$B$3,\"\")","v":""},"3XL-4XL",{"$f":"IF(Master!F172<>\"\",Master!F172*Selection!$B$3,\"\")","v":8},{"$f":"IF(Factor!#REF!<>\"\",Factor!#REF!*Selection!$B$3,\"\")","v":{"$error":"#REF!"}}]
[]
[{"$f":"IF(Selection!$B$4=\"PL\",\"DZIECI\",IF(Selection!$B$4=\"SE\",\"BARN\",IF(Selection!$B$4=\"GB\",\"CHILDREN\",IF(Selection!$B$4=\"DE\",\"KINDER\",\"BØRN\"))))","v":"CHILDREN"}]
["40500",{"$f":"IF(Selection!$B$4=\"DK\",VLOOKUP($A175,'Style navne sprog'!$A:$I,6,FALSE),IF(Selection!$B$4=\"DE\",VLOOKUP($A175,'Style navne sprog'!$A:$I,2,FALSE),IF(Selection!$B$4=\"GB\",VLOOKUP($A175,'Style navne sprog'!$A:$I,4,FALSE),IF(Selection!$B$4=\"SE\",VLOOKUP($A175,'Style navne sprog'!$A:$I,3,FALSE),IF(Selection!$B$4=\"NO\",VLOOKUP($A175,'Style navne sprog'!$A:$I,5,FALSE),IF(Selection!$B$4=\"PL\",VLOOKUP($A175,'Style navne sprog'!$A:$I,7,FALSE)))))))","v":"GAME T-shirt | children"},{"$f":"IF(Master!C175<>\"\",Master!C175*Selection!$B$3,\"\")","v":14.100000000000001},{"$f":"IF(Master!D175<>\"\",Master!D175*Selection!$B$3,\"\")","v":12.8},"",{"$f":"IF(Master!F175<>\"\",Master!F175*Selection!$B$3,\"\")","v":""},{"$f":"IF(Factor!#REF!<>\"\",Factor!#REF!*Selection!$B$3,\"\")","v":{"$error":"#REF!"}}]
["40510",{"$f":"IF(Selection!$B$4=\"DK\",VLOOKUP($A176,'Style navne sprog'!$A:$I,6,FALSE),IF(Selection!$B$4=\"DE\",VLOOKUP($A176,'Style navne sprog'!$A:$I,2,FALSE),IF(Selection!$B$4=\"GB\",VLOOKUP($A176,'Style navne sprog'!$A:$I,4,FALSE),IF(Selection!$B$4=\"SE\",VLOOKUP($A176,'Style navne sprog'!$A:$I,3,FALSE),IF(Selection!$B$4=\"NO\",VLOOKUP($A176,'Style navne sprog'!$A:$I,5,FALSE),IF(Selection!$B$4=\"PL\",VLOOKUP($A176,'Style navne sprog'!$A:$I,7,FALSE)))))))","v":"T-TIME® T-shirt | children"},{"$f":"IF(Master!C176<>\"\",Master!C176*Selection!$B$3,\"\")","v":19.600000000000001},{"$f":"IF(Master!D176<>\"\",Master!D176*Selection!$B$3,\"\")","v":18.3},"",{"$f":"IF(Master!F176<>\"\",Master!F176*Selection!$B$3,\"\")","v":""},{"$f":"IF(Factor!#REF!<>\"\",Factor!#REF!*Selection!$B$3,\"\")","v":{"$error":"#REF!"}}]
["40552",{"$f":"IF(Selection!$B$4=\"DK\",VLOOKUP($A177,'Style navne sprog'!$A:$I,6,FALSE),IF(Selection!$B$4=\"DE\",VLOOKUP($A177,'Style navne sprog'!$A:$I,2,FALSE),IF(Selection!$B$4=\"GB\",VLOOKUP($A177,'Style navne sprog'!$A:$I,4,FALSE),IF(Selection!$B$4=\"SE\",VLOOKUP($A177,'Style navne sprog'!$A:$I,3,FALSE),IF(Selection!$B$4=\"NO\",VLOOKUP($A177,'Style navne sprog'!$A:$I,5,FALSE),IF(Selection!$B$4=\"PL\",VLOOKUP($A177,'Style navne sprog'!$A:$I,7,FALSE)))))))","v":"Organic T-shirt | children"},{"$f":"IF(Master!C177<>\"\",Master!C177*Selection!$B$3,\"\")","v":22.1},{"$f":"IF(Master!D177<>\"\",Master!D177*Selection!$B$3,\"\")","v":20.8},"",{"$f":"IF(Master!F177<>\"\",Master!F177*Selection!$B$3,\"\")","v":""},{"$f":"IF(Factor!#REF!<>\"\",Factor!#REF!*Selection!$B$3,\"\")","v":{"$error":"#REF!"}}]
["40634",{"$f":"IF(Selection!$B$4=\"DK\",VLOOKUP($A178,'Style navne sprog'!$A:$I,6,FALSE),IF(Selection!$B$4=\"DE\",VLOOKUP($A178,'Style navne sprog'!$A:$I,2,FALSE),IF(Selection!$B$4=\"GB\",VLOOKUP($A178,'Style navne sprog'!$A:$I,4,FALSE),IF(Selection!$B$4=\"SE\",VLOOKUP($A178,'Style navne sprog'!$A:$I,3,FALSE),IF(Selection!$B$4=\"NO\",VLOOKUP($A178,'Style navne sprog'!$A:$I,5,FALSE),IF(Selection!$B$4=\"PL\",VLOOKUP($A178,'Style navne sprog'!$A:$I,7,FALSE)))))))","v":"CORE sweatshirt | children"},{"$f":"IF(Master!C178<>\"\",Master!C178*Selection!$B$3,\"\")","v":44.6},{"$f":"IF(Master!D178<>\"\",Master!D178*Selection!$B$3,\"\")","v":""},"",{"$f":"IF(Master!F178<>\"\",Master!F178*Selection!$B$3,\"\")","v":""},{"$f":"IF(Factor!#REF!<>\"\",Factor!#REF!*Selection!$B$3,\"\")","v":{"$error":"#REF!"}}]
["40636",{"$f":"IF(Selection!$B$4=\"DK\",VLOOKUP($A179,'Style navne sprog'!$A:$I,6,FALSE),IF(Selection!$B$4=\"DE\",VLOOKUP($A179,'Style navne sprog'!$A:$I,2,FALSE),IF(Selection!$B$4=\"GB\",VLOOKUP($A179,'Style navne sprog'!$A:$I,4,FALSE),IF(Selection!$B$4=\"SE\",VLOOKUP($A179,'Style navne sprog'!$A:$I,3,FALSE),IF(Selection!$B$4=\"NO\",VLOOKUP($A179,'Style navne sprog'!$A:$I,5,FALSE),IF(Selection!$B$4=\"PL\",VLOOKUP($A179,'Style navne sprog'!$A:$I,7,FALSE)))))))","v":"CORE hoodie | children"},{"$f":"IF(Master!C179<>\"\",Master!C179*Selection!$B$3,\"\")","v":55},{"$f":"IF(Master!D179<>\"\",Master!D179*Selection!$B$3,\"\")","v":""},"",{"$f":"IF(Master!F179<>\"\",Master!F179*Selection!$B$3,\"\")","v":""},{"$f":"IF(Factor!#REF!<>\"\",Factor!#REF!*Selection!$B$3,\"\")","v":{"$error":"#REF!"}}]
["40638",{"$f":"IF(Selection!$B$4=\"DK\",VLOOKUP($A180,'Style navne sprog'!$A:$I,6,FALSE),IF(Selection!$B$4=\"DE\",VLOOKUP($A180,'Style navne sprog'!$A:$I,2,FALSE),IF(Selection!$B$4=\"GB\",VLOOKUP($A180,'Style navne sprog'!$A:$I,4,FALSE),IF(Selection!$B$4=\"SE\",VLOOKUP($A180,'Style navne sprog'!$A:$I,3,FALSE),IF(Selection!$B$4=\"NO\",VLOOKUP($A180,'Style navne sprog'!$A:$I,5,FALSE),IF(Selection!$B$4=\"PL\",VLOOKUP($A180,'Style navne sprog'!$A:$I,7,FALSE)))))))","v":"CORE zip hoodie | children"},{"$f":"IF(Master!C180<>\"\",Master!C180*Selection!$B$3,\"\")","v":55},{"$f":"IF(Master!D180<>\"\",Master!D180*Selection!$B$3,\"\")","v":""},"",{"$f":"IF(Master!F180<>\"\",Master!F180*Selection!$B$3,\"\")","v":""},{"$f":"IF(Factor!#REF!<>\"\",Factor!#REF!*Selection!$B$3,\"\")","v":{"$error":"#REF!"}}]
["40836",{"$f":"IF(Selection!$B$4=\"DK\",VLOOKUP($A181,'Style navne sprog'!$A:$I,6,FALSE),IF(Selection!$B$4=\"DE\",VLOOKUP($A181,'Style navne sprog'!$A:$I,2,FALSE),IF(Selection!$B$4=\"GB\",VLOOKUP($A181,'Style navne sprog'!$A:$I,4,FALSE),IF(Selection!$B$4=\"SE\",VLOOKUP($A181,'Style navne sprog'!$A:$I,3,FALSE),IF(Selection!$B$4=\"NO\",VLOOKUP($A181,'Style navne sprog'!$A:$I,5,FALSE),IF(Selection!$B$4=\"PL\",VLOOKUP($A181,'Style navne sprog'!$A:$I,7,FALSE)))))))","v":"Soft shell jacket | light | children"},{"$f":"IF(Master!C181<>\"\",Master!C181*Selection!$B$3,\"\")","v":122.7},{"$f":"IF(Master!D181<>\"\",Master!D181*Selection!$B$3,\"\")","v":""},"",{"$f":"IF(Master!F181<>\"\",Master!F181*Selection!$B$3,\"\")","v":""},{"$f":"IF(Factor!#REF!<>\"\",Factor!#REF!*Selection!$B$3,\"\")","v":{"$error":"#REF!"}}]
["42030",{"$f":"IF(Selection!$B$4=\"DK\",VLOOKUP($A182,'Style navne sprog'!$A:$I,6,FALSE),IF(Selection!$B$4=\"DE\",VLOOKUP($A182,'Style navne sprog'!$A:$I,2,FALSE),IF(Selection!$B$4=\"GB\",VLOOKUP($A182,'Style navne sprog'!$A:$I,4,FALSE),IF(Selection!$B$4=\"SE\",VLOOKUP($A182,'Style navne sprog'!$A:$I,3,FALSE),IF(Selection!$B$4=\"NO\",VLOOKUP($A182,'Style navne sprog'!$A:$I,5,FALSE),IF(Selection!$B$4=\"PL\",VLOOKUP($A182,'Style navne sprog'!$A:$I,7,FALSE)))))))","v":"YES Active T-shirt | children"},{"$f":"IF(Master!C182<>\"\",Master!C182*Selection!$B$3,\"\")","v":20.400000000000002},{"$f":"IF(Master!D182<>\"\",Master!D182*Selection!$B$3,\"\")","v":19.100000000000001},"",{"$f":"IF(Master!F182<>\"\",Master!F182*Selection!$B$3,\"\")","v":""},{"$f":"IF(Factor!#REF!<>\"\",Factor!#REF!*Selection!$B$3,\"\")","v":{"$error":"#REF!"}}]
[]
[{"$f":"IF(Selection!$B$4=\"PL\",\"AKCESORIA\",IF(Selection!$B$4=\"SE\",\"ACCESSOARER\",IF(Selection!$B$4=\"GB\",\"ACCESSORIES\",IF(Selection!$B$4=\"DE\",\"ACCESSORIES\",\"ACCESSORIES\"))))","v":"ACCESSORIES"}]
["0010",{"$f":"IF(Selection!$B$4=\"DK\",VLOOKUP($A185,'Style navne sprog'!$A:$I,6,FALSE),IF(Selection!$B$4=\"DE\",VLOOKUP($A185,'Style navne sprog'!$A:$I,2,FALSE),IF(Selection!$B$4=\"GB\",VLOOKUP($A185,'Style navne sprog'!$A:$I,4,FALSE),IF(Selection!$B$4=\"SE\",VLOOKUP($A185,'Style navne sprog'!$A:$I,3,FALSE),IF(Selection!$B$4=\"NO\",VLOOKUP($A185,'Style navne sprog'!$A:$I,5,FALSE),IF(Selection!$B$4=\"PL\",VLOOKUP($A185,'Style navne sprog'!$A:$I,7,FALSE)))))))","v":"Towel 50x100"},{"$f":"IF(Master!C185<>\"\",Master!C185*Selection!$B$3,\"\")","v":23.900000000000002},{"$f":"IF(Master!D185<>\"\",Master!D185*Selection!$B$3,\"\")","v":""},"",{"$f":"IF(Master!F185<>\"\",Master!F185*Selection!$B$3,\"\")","v":""},{"$f":"IF(Factor!#REF!<>\"\",Factor!#REF!*Selection!$B$3,\"\")","v":{"$error":"#REF!"}}]
["0011",{"$f":"IF(Selection!$B$4=\"DK\",VLOOKUP($A186,'Style navne sprog'!$A:$I,6,FALSE),IF(Selection!$B$4=\"DE\",VLOOKUP($A186,'Style navne sprog'!$A:$I,2,FALSE),IF(Selection!$B$4=\"GB\",VLOOKUP($A186,'Style navne sprog'!$A:$I,4,FALSE),IF(Selection!$B$4=\"SE\",VLOOKUP($A186,'Style navne sprog'!$A:$I,3,FALSE),IF(Selection!$B$4=\"NO\",VLOOKUP($A186,'Style navne sprog'!$A:$I,5,FALSE),IF(Selection!$B$4=\"PL\",VLOOKUP($A186,'Style navne sprog'!$A:$I,7,FALSE)))))))","v":"Bath towel 70x140"},{"$f":"IF(Master!C186<>\"\",Master!C186*Selection!$B$3,\"\")","v":39.300000000000004},{"$f":"IF(Master!D186<>\"\",Master!D186*Selection!$B$3,\"\")","v":""},"",{"$f":"IF(Master!F186<>\"\",Master!F186*Selection!$B$3,\"\")","v":""},{"$f":"IF(Factor!#REF!<>\"\",Factor!#REF!*Selection!$B$3,\"\")","v":{"$error":"#REF!"}}]
["0036",{"$f":"IF(Selection!$B$4=\"DK\",VLOOKUP($A187,'Style navne sprog'!$A:$I,6,FALSE),IF(Selection!$B$4=\"DE\",VLOOKUP($A187,'Style navne sprog'!$A:$I,2,FALSE),IF(Selection!$B$4=\"GB\",VLOOKUP($A187,'Style navne sprog'!$A:$I,4,FALSE),IF(Selection!$B$4=\"SE\",VLOOKUP($A187,'Style navne sprog'!$A:$I,3,FALSE),IF(Selection!$B$4=\"NO\",VLOOKUP($A187,'Style navne sprog'!$A:$I,5,FALSE),IF(Selection!$B$4=\"PL\",VLOOKUP($A187,'Style navne sprog'!$A:$I,7,FALSE)))))))","v":"Hat | stretch"},{"$f":"IF(Master!C187<>\"\",Master!C187*Selection!$B$3,\"\")","v":16.900000000000002},{"$f":"IF(Master!D187<>\"\",Master!D187*Selection!$B$3,\"\")","v":""},"",{"$f":"IF(Master!F187<>\"\",Master!F187*Selection!$B$3,\"\")","v":""},{"$f":"IF(Factor!#REF!<>\"\",Factor!#REF!*Selection!$B$3,\"\")","v":{"$error":"#REF!"}}]
["0038",{"$f":"IF(Selection!$B$4=\"DK\",VLOOKUP($A188,'Style navne sprog'!$A:$I,6,FALSE),IF(Selection!$B$4=\"DE\",VLOOKUP($A188,'Style navne sprog'!$A:$I,2,FALSE),IF(Selection!$B$4=\"GB\",VLOOKUP($A188,'Style navne sprog'!$A:$I,4,FALSE),IF(Selection!$B$4=\"SE\",VLOOKUP($A188,'Style navne sprog'!$A:$I,3,FALSE),IF(Selection!$B$4=\"NO\",VLOOKUP($A188,'Style navne sprog'!$A:$I,5,FALSE),IF(Selection!$B$4=\"PL\",VLOOKUP($A188,'Style navne sprog'!$A:$I,7,FALSE)))))))","v":"Neck warmer | stretch"},{"$f":"IF(Master!C188<>\"\",Master!C188*Selection!$B$3,\"\")","v":15.3},{"$f":"IF(Master!D188<>\"\",Master!D188*Selection!$B$3,\"\")","v":""},"",{"$f":"IF(Master!F188<>\"\",Master!F188*Selection!$B$3,\"\")","v":""},{"$f":"IF(Factor!#REF!<>\"\",Factor!#REF!*Selection!$B$3,\"\")","v":{"$error":"#REF!"}}]
["0040",{"$f":"IF(Selection!$B$4=\"DK\",VLOOKUP($A189,'Style navne sprog'!$A:$I,6,FALSE),IF(Selection!$B$4=\"DE\",VLOOKUP($A189,'Style navne sprog'!$A:$I,2,FALSE),IF(Selection!$B$4=\"GB\",VLOOKUP($A189,'Style navne sprog'!$A:$I,4,FALSE),IF(Selection!$B$4=\"SE\",VLOOKUP($A189,'Style navne sprog'!$A:$I,3,FALSE),IF(Selection!$B$4=\"NO\",VLOOKUP($A189,'Style navne sprog'!$A:$I,5,FALSE),IF(Selection!$B$4=\"PL\",VLOOKUP($A189,'Style navne sprog'!$A:$I,7,FALSE)))))))","v":"Soft neck warmer"},{"$f":"IF(Master!C189<>\"\",Master!C189*Selection!$B$3,\"\")","v":23.900000000000002},{"$f":"IF(Master!D189<>\"\",Master!D189*Selection!$B$3,\"\")","v":""},"",{"$f":"IF(Master!F189<>\"\",Master!F189*Selection!$B$3,\"\")","v":""},{"$f":"IF(Factor!#REF!<>\"\",Factor!#REF!*Selection!$B$3,\"\")","v":{"$error":"#REF!"}}]
["0042",{"$f":"IF(Selection!$B$4=\"DK\",VLOOKUP($A190,'Style navne sprog'!$A:$I,6,FALSE),IF(Selection!$B$4=\"DE\",VLOOKUP($A190,'Style navne sprog'!$A:$I,2,FALSE),IF(Selection!$B$4=\"GB\",VLOOKUP($A190,'Style navne sprog'!$A:$I,4,FALSE),IF(Selection!$B$4=\"SE\",VLOOKUP($A190,'Style navne sprog'!$A:$I,3,FALSE),IF(Selection!$B$4=\"NO\",VLOOKUP($A190,'Style navne sprog'!$A:$I,5,FALSE),IF(Selection!$B$4=\"PL\",VLOOKUP($A190,'Style navne sprog'!$A:$I,7,FALSE)))))))","v":"Knitted hat"},{"$f":"IF(Master!C190<>\"\",Master!C190*Selection!$B$3,\"\")","v":18.100000000000001},{"$f":"IF(Master!D190<>\"\",Master!D190*Selection!$B$3,\"\")","v":""},"",{"$f":"IF(Master!F190<>\"\",Master!F190*Selection!$B$3,\"\")","v":""},{"$f":"IF(Factor!#REF!<>\"\",Factor!#REF!*Selection!$B$3,\"\")","v":{"$error":"#REF!"}}]
["0045",{"$f":"IF(Selection!$B$4=\"DK\",VLOOKUP($A191,'Style navne sprog'!$A:$I,6,FALSE),IF(Selection!$B$4=\"DE\",VLOOKUP($A191,'Style navne sprog'!$A:$I,2,FALSE),IF(Selection!$B$4=\"GB\",VLOOKUP($A191,'Style navne sprog'!$A:$I,4,FALSE),IF(Selection!$B$4=\"SE\",VLOOKUP($A191,'Style navne sprog'!$A:$I,3,FALSE),IF(Selection!$B$4=\"NO\",VLOOKUP($A191,'Style navne sprog'!$A:$I,5,FALSE),IF(Selection!$B$4=\"PL\",VLOOKUP($A191,'Style navne sprog'!$A:$I,7,FALSE)))))))","v":"Stretch hat"},{"$f":"IF(Master!C191<>\"\",Master!C191*Selection!$B$3,\"\")","v":21.200000000000003},{"$f":"IF(Master!D191<>\"\",Master!D191*Selection!$B$3,\"\")","v":""},"",{"$f":"IF(Master!F191<>\"\",Master!F191*Selection!$B$3,\"\")","v":""},{"$f":"IF(Factor!#REF!<>\"\",Factor!#REF!*Selection!$B$3,\"\")","v":{"$error":"#REF!"}}]
["0044",{"$f":"IF(Selection!$B$4=\"DK\",VLOOKUP($A192,'Style navne sprog'!$A:$I,6,FALSE),IF(Selection!$B$4=\"DE\",VLOOKUP($A192,'Style navne sprog'!$A:$I,2,FALSE),IF(Selection!$B$4=\"GB\",VLOOKUP($A192,'Style navne sprog'!$A:$I,4,FALSE),IF(Selection!$B$4=\"SE\",VLOOKUP($A192,'Style navne sprog'!$A:$I,3,FALSE),IF(Selection!$B$4=\"NO\",VLOOKUP($A192,'Style navne sprog'!$A:$I,5,FALSE),IF(Selection!$B$4=\"PL\",VLOOKUP($A192,'Style navne sprog'!$A:$I,7,FALSE)))))))","v":"Knitted hat | lining"},{"$f":"IF(Master!C192<>\"\",Master!C192*Selection!$B$3,\"\")","v":22.3},{"$f":"IF(Master!D192<>\"\",Master!D192*Selection!$B$3,\"\")","v":""},"",{"$f":"IF(Master!F192<>\"\",Master!F192*Selection!$B$3,\"\")","v":""},{"$f":"IF(Factor!#REF!<>\"\",Factor!#REF!*Selection!$B$3,\"\")","v":{"$error":"#REF!"}}]
["0050",{"$f":"IF(Selection!$B$4=\"DK\",VLOOKUP($A193,'Style navne sprog'!$A:$I,6,FALSE),IF(Selection!$B$4=\"DE\",VLOOKUP($A193,'Style navne sprog'!$A:$I,2,FALSE),IF(Selection!$B$4=\"GB\",VLOOKUP($A193,'Style navne sprog'!$A:$I,4,FALSE),IF(Selection!$B$4=\"SE\",VLOOKUP($A193,'Style navne sprog'!$A:$I,3,FALSE),IF(Selection!$B$4=\"NO\",VLOOKUP($A193,'Style navne sprog'!$A:$I,5,FALSE),IF(Selection!$B$4=\"PL\",VLOOKUP($A193,'Style navne sprog'!$A:$I,7,FALSE)))))))","v":"Urban cap"},{"$f":"IF(Master!C193<>\"\",Master!C193*Selection!$B$3,\"\")","v":18.5},{"$f":"IF(Master!D193<>\"\",Master!D193*Selection!$B$3,\"\")","v":""},"",{"$f":"IF(Master!F193<>\"\",Master!F193*Selection!$B$3,\"\")","v":""},{"$f":"IF(Factor!#REF!<>\"\",Factor!#REF!*Selection!$B$3,\"\")","v":{"$error":"#REF!"}}]
["0052",{"$f":"IF(Selection!$B$4=\"DK\",VLOOKUP($A194,'Style navne sprog'!$A:$I,6,FALSE),IF(Selection!$B$4=\"DE\",VLOOKUP($A194,'Style navne sprog'!$A:$I,2,FALSE),IF(Selection!$B$4=\"GB\",VLOOKUP($A194,'Style navne sprog'!$A:$I,4,FALSE),IF(Selection!$B$4=\"SE\",VLOOKUP($A194,'Style navne sprog'!$A:$I,3,FALSE),IF(Selection!$B$4=\"NO\",VLOOKUP($A194,'Style navne sprog'!$A:$I,5,FALSE),IF(Selection!$B$4=\"PL\",VLOOKUP($A194,'Style navne sprog'!$A:$I,7,FALSE)))))))","v":"Golf cap"},{"$f":"IF(Master!C194<>\"\",Master!C194*Selection!$B$3,\"\")","v":9.9},{"$f":"IF(Master!D194<>\"\",Master!D194*Selection!$B$3,\"\")","v":""},"",{"$f":"IF(Master!F194<>\"\",Master!F194*Selection!$B$3,\"\")","v":""},{"$f":"IF(Factor!#REF!<>\"\",Factor!#REF!*Selection!$B$3,\"\")","v":{"$error":"#REF!"}}]
["0054",{"$f":"IF(Selection!$B$4=\"DK\",VLOOKUP($A195,'Style navne sprog'!$A:$I,6,FALSE),IF(Selection!$B$4=\"DE\",VLOOKUP($A195,'Style navne sprog'!$A:$I,2,FALSE),IF(Selection!$B$4=\"GB\",VLOOKUP($A195,'Style navne sprog'!$A:$I,4,FALSE),IF(Selection!$B$4=\"SE\",VLOOKUP($A195,'Style navne sprog'!$A:$I,3,FALSE),IF(Selection!$B$4=\"NO\",VLOOKUP($A195,'Style navne sprog'!$A:$I,5,FALSE),IF(Selection!$B$4=\"PL\",VLOOKUP($A195,'Style navne sprog'!$A:$I,7,FALSE)))))))","v":"Twill cap"},{"$f":"IF(Master!C195<>\"\",Master!C195*Selection!$B$3,\"\")","v":13},{"$f":"IF(Master!D195<>\"\",Master!D195*Selection!$B$3,\"\")","v":""},"",{"$f":"IF(Master!F195<>\"\",Master!F195*Selection!$B$3,\"\")","v":""},{"$f":"IF(Factor!#REF!<>\"\",Factor!#REF!*Selection!$B$3,\"\")","v":{"$error":"#REF!"}}]
["0060",{"$f":"IF(Selection!$B$4=\"DK\",VLOOKUP($A196,'Style navne sprog'!$A:$I,6,FALSE),IF(Selection!$B$4=\"DE\",VLOOKUP($A196,'Style navne sprog'!$A:$I,2,FALSE),IF(Selection!$B$4=\"GB\",VLOOKUP($A196,'Style navne sprog'!$A:$I,4,FALSE),IF(Selection!$B$4=\"SE\",VLOOKUP($A196,'Style navne sprog'!$A:$I,3,FALSE),IF(Selection!$B$4=\"NO\",VLOOKUP($A196,'Style navne sprog'!$A:$I,5,FALSE),IF(Selection!$B$4=\"PL\",VLOOKUP($A196,'Style navne sprog'!$A:$I,7,FALSE)))))))","v":"Classic canvas bucket hat"},{"$f":"IF(Master!C196<>\"\",Master!C196*Selection!$B$3,\"\")","v":18.5},{"$f":"IF(Master!D196<>\"\",Master!D196*Selection!$B$3,\"\")","v":""},"",{"$f":"IF(Master!F196<>\"\",Master!F196*Selection!$B$3,\"\")","v":""},{"$f":"IF(Factor!#REF!<>\"\",Factor!#REF!*Selection!$B$3,\"\")","v":{"$error":"#REF!"}}]
["0068",{"$f":"IF(Selection!$B$4=\"DK\",VLOOKUP($A197,'Style navne sprog'!$A:$I,6,FALSE),IF(Selection!$B$4=\"DE\",VLOOKUP($A197,'Style navne sprog'!$A:$I,2,FALSE),IF(Selection!$B$4=\"GB\",VLOOKUP($A197,'Style navne sprog'!$A:$I,4,FALSE),IF(Selection!$B$4=\"SE\",VLOOKUP($A197,'Style navne sprog'!$A:$I,3,FALSE),IF(Selection!$B$4=\"NO\",VLOOKUP($A197,'Style navne sprog'!$A:$I,5,FALSE),IF(Selection!$B$4=\"PL\",VLOOKUP($A197,'Style navne sprog'!$A:$I,7,FALSE)))))))","v":"Cap | stretch"},{"$f":"IF(Master!C197<>\"\",Master!C197*Selection!$B$3,\"\")","v":18.100000000000001},{"$f":"IF(Master!D197<>\"\",Master!D197*Selection!$B$3,\"\")","v":""},"",{"$f":"IF(Master!F197<>\"\",Master!F197*Selection!$B$3,\"\")","v":""},{"$f":"IF(Factor!#REF!<>\"\",Factor!#REF!*Selection!$B$3,\"\")","v":{"$error":"#REF!"}}]
["0073",{"$f":"IF(Selection!$B$4=\"DK\",VLOOKUP($A198,'Style navne sprog'!$A:$I,6,FALSE),IF(Selection!$B$4=\"DE\",VLOOKUP($A198,'Style navne sprog'!$A:$I,2,FALSE),IF(Selection!$B$4=\"GB\",VLOOKUP($A198,'Style navne sprog'!$A:$I,4,FALSE),IF(Selection!$B$4=\"SE\",VLOOKUP($A198,'Style navne sprog'!$A:$I,3,FALSE),IF(Selection!$B$4=\"NO\",VLOOKUP($A198,'Style navne sprog'!$A:$I,5,FALSE),IF(Selection!$B$4=\"PL\",VLOOKUP($A198,'Style navne sprog'!$A:$I,7,FALSE)))))))","v":"Apron"},{"$f":"IF(Master!C198<>\"\",Master!C198*Selection!$B$3,\"\")","v":38.400000000000006},{"$f":"IF(Master!D198<>\"\",Master!D198*Selection!$B$3,\"\")","v":""},"",{"$f":"IF(Master!F198<>\"\",Master!F198*Selection!$B$3,\"\")","v":""},{"$f":"IF(Factor!#REF!<>\"\",Factor!#REF!*Selection!$B$3,\"\")","v":{"$error":"#REF!"}}]
["0074",{"$f":"IF(Selection!$B$4=\"DK\",VLOOKUP($A199,'Style navne sprog'!$A:$I,6,FALSE),IF(Selection!$B$4=\"DE\",VLOOKUP($A199,'Style navne sprog'!$A:$I,2,FALSE),IF(Selection!$B$4=\"GB\",VLOOKUP($A199,'Style navne sprog'!$A:$I,4,FALSE),IF(Selection!$B$4=\"SE\",VLOOKUP($A199,'Style navne sprog'!$A:$I,3,FALSE),IF(Selection!$B$4=\"NO\",VLOOKUP($A199,'Style navne sprog'!$A:$I,5,FALSE),IF(Selection!$B$4=\"PL\",VLOOKUP($A199,'Style navne sprog'!$A:$I,7,FALSE)))))))","v":"Serving apron"},{"$f":"IF(Master!C199<>\"\",Master!C199*Selection!$B$3,\"\")","v":38.400000000000006},{"$f":"IF(Master!D199<>\"\",Master!D199*Selection!$B$3,\"\")","v":""},"",{"$f":"IF(Master!F199<>\"\",Master!F199*Selection!$B$3,\"\")","v":""},{"$f":"IF(Factor!#REF!<>\"\",Factor!#REF!*Selection!$B$3,\"\")","v":{"$error":"#REF!"}}]
["0170",{"$f":"IF(Selection!$B$4=\"DK\",VLOOKUP($A200,'Style navne sprog'!$A:$I,6,FALSE),IF(Selection!$B$4=\"DE\",VLOOKUP($A200,'Style navne sprog'!$A:$I,2,FALSE),IF(Selection!$B$4=\"GB\",VLOOKUP($A200,'Style navne sprog'!$A:$I,4,FALSE),IF(Selection!$B$4=\"SE\",VLOOKUP($A200,'Style navne sprog'!$A:$I,3,FALSE),IF(Selection!$B$4=\"NO\",VLOOKUP($A200,'Style navne sprog'!$A:$I,5,FALSE),IF(Selection!$B$4=\"PL\",VLOOKUP($A200,'Style navne sprog'!$A:$I,7,FALSE)))))))","v":"Durable socks"},{"$f":"IF(Master!C200<>\"\",Master!C200*Selection!$B$3,\"\")","v":13.200000000000001},{"$f":"IF(Master!D200<>\"\",Master!D200*Selection!$B$3,\"\")","v":""},"",{"$f":"IF(Master!F200<>\"\",Master!F200*Selection!$B$3,\"\")","v":""},{"$f":"IF(Factor!#REF!<>\"\",Factor!#REF!*Selection!$B$3,\"\")","v":{"$error":"#REF!"}}]
["1510",{"$f":"IF(Selection!$B$4=\"DK\",VLOOKUP($A201,'Style navne sprog'!$A:$I,6,FALSE),IF(Selection!$B$4=\"DE\",VLOOKUP($A201,'Style navne sprog'!$A:$I,2,FALSE),IF(Selection!$B$4=\"GB\",VLOOKUP($A201,'Style navne sprog'!$A:$I,4,FALSE),IF(Selection!$B$4=\"SE\",VLOOKUP($A201,'Style navne sprog'!$A:$I,3,FALSE),IF(Selection!$B$4=\"NO\",VLOOKUP($A201,'Style navne sprog'!$A:$I,5,FALSE),IF(Selection!$B$4=\"PL\",VLOOKUP($A201,'Style navne sprog'!$A:$I,7,FALSE)))))))","v":"Cotton bag"},{"$f":"IF(Master!C201<>\"\",Master!C201*Selection!$B$3,\"\")","v":13.3},{"$f":"IF(Master!D201<>\"\",Master!D201*Selection!$B$3,\"\")","v":""},"",{"$f":"IF(Master!F201<>\"\",Master!F201*Selection!$B$3,\"\")","v":""},{"$f":"IF(Factor!#REF!<>\"\",Factor!#REF!*Selection!$B$3,\"\")","v":{"$error":"#REF!"}}]
["1800",{"$f":"IF(Selection!$B$4=\"DK\",VLOOKUP($A202,'Style navne sprog'!$A:$I,6,FALSE),IF(Selection!$B$4=\"DE\",VLOOKUP($A202,'Style navne sprog'!$A:$I,2,FALSE),IF(Selection!$B$4=\"GB\",VLOOKUP($A202,'Style navne sprog'!$A:$I,4,FALSE),IF(Selection!$B$4=\"SE\",VLOOKUP($A202,'Style navne sprog'!$A:$I,3,FALSE),IF(Selection!$B$4=\"NO\",VLOOKUP($A202,'Style navne sprog'!$A:$I,5,FALSE),IF(Selection!$B$4=\"PL\",VLOOKUP($A202,'Style navne sprog'!$A:$I,7,FALSE)))))))","v":"Sports bag"},{"$f":"IF(Master!C202<>\"\",Master!C202*Selection!$B$3,\"\")","v":56.5},{"$f":"IF(Master!D202<>\"\",Master!D202*Selection!$B$3,\"\")","v":""},"",{"$f":"IF(Master!F202<>\"\",Master!F202*Selection!$B$3,\"\")","v":""},{"$f":"IF(Factor!#REF!<>\"\",Factor!#REF!*Selection!$B$3,\"\")","v":{"$error":"#REF!"}}]
["1802",{"$f":"IF(Selection!$B$4=\"DK\",VLOOKUP($A203,'Style navne sprog'!$A:$I,6,FALSE),IF(Selection!$B$4=\"DE\",VLOOKUP($A203,'Style navne sprog'!$A:$I,2,FALSE),IF(Selection!$B$4=\"GB\",VLOOKUP($A203,'Style navne sprog'!$A:$I,4,FALSE),IF(Selection!$B$4=\"SE\",VLOOKUP($A203,'Style navne sprog'!$A:$I,3,FALSE),IF(Selection!$B$4=\"NO\",VLOOKUP($A203,'Style navne sprog'!$A:$I,5,FALSE),IF(Selection!$B$4=\"PL\",VLOOKUP($A203,'Style navne sprog'!$A:$I,7,FALSE)))))))","v":"Large sports bag | trolley"},{"$f":"IF(Master!C203<>\"\",Master!C203*Selection!$B$3,\"\")","v":108.30000000000001},{"$f":"IF(Master!D203<>\"\",Master!D203*Selection!$B$3,\"\")","v":""},"",{"$f":"IF(Master!F203<>\"\",Master!F203*Selection!$B$3,\"\")","v":""},{"$f":"IF(Factor!#REF!<>\"\",Factor!#REF!*Selection!$B$3,\"\")","v":{"$error":"#REF!"}}]
["1805",{"$f":"IF(Selection!$B$4=\"DK\",VLOOKUP($A204,'Style navne sprog'!$A:$I,6,FALSE),IF(Selection!$B$4=\"DE\",VLOOKUP($A204,'Style navne sprog'!$A:$I,2,FALSE),IF(Selection!$B$4=\"GB\",VLOOKUP($A204,'Style navne sprog'!$A:$I,4,FALSE),IF(Selection!$B$4=\"SE\",VLOOKUP($A204,'Style navne sprog'!$A:$I,3,FALSE),IF(Selection!$B$4=\"NO\",VLOOKUP($A204,'Style navne sprog'!$A:$I,5,FALSE),IF(Selection!$B$4=\"PL\",VLOOKUP($A204,'Style navne sprog'!$A:$I,7,FALSE)))))))","v":"Ripstop backpack"},{"$f":"IF(Master!C204<>\"\",Master!C204*Selection!$B$3,\"\")","v":56.400000000000006},{"$f":"IF(Master!D204<>\"\",Master!D204*Selection!$B$3,\"\")","v":""},"",{"$f":"IF(Master!F204<>\"\",Master!F204*Selection!$B$3,\"\")","v":""},{"$f":"IF(Factor!#REF!<>\"\",Factor!#REF!*Selection!$B$3,\"\")","v":{"$error":"#REF!"}}]
["1810",{"$f":"IF(Selection!$B$4=\"DK\",VLOOKUP($A205,'Style navne sprog'!$A:$I,6,FALSE),IF(Selection!$B$4=\"DE\",VLOOKUP($A205,'Style navne sprog'!$A:$I,2,FALSE),IF(Selection!$B$4=\"GB\",VLOOKUP($A205,'Style navne sprog'!$A:$I,4,FALSE),IF(Selection!$B$4=\"SE\",VLOOKUP($A205,'Style navne sprog'!$A:$I,3,FALSE),IF(Selection!$B$4=\"NO\",VLOOKUP($A205,'Style navne sprog'!$A:$I,5,FALSE),IF(Selection!$B$4=\"PL\",VLOOKUP($A205,'Style navne sprog'!$A:$I,7,FALSE)))))))","v":"Backpack"},{"$f":"IF(Master!C205<>\"\",Master!C205*Selection!$B$3,\"\")","v":56.5},{"$f":"IF(Master!D205<>\"\",Master!D205*Selection!$B$3,\"\")","v":""},"",{"$f":"IF(Master!F205<>\"\",Master!F205*Selection!$B$3,\"\")","v":""},{"$f":"IF(Factor!#REF!<>\"\",Factor!#REF!*Selection!$B$3,\"\")","v":{"$error":"#REF!"}}]
["1820",{"$f":"IF(Selection!$B$4=\"DK\",VLOOKUP($A206,'Style navne sprog'!$A:$I,6,FALSE),IF(Selection!$B$4=\"DE\",VLOOKUP($A206,'Style navne sprog'!$A:$I,2,FALSE),IF(Selection!$B$4=\"GB\",VLOOKUP($A206,'Style navne sprog'!$A:$I,4,FALSE),IF(Selection!$B$4=\"SE\",VLOOKUP($A206,'Style navne sprog'!$A:$I,3,FALSE),IF(Selection!$B$4=\"NO\",VLOOKUP($A206,'Style navne sprog'!$A:$I,5,FALSE),IF(Selection!$B$4=\"PL\",VLOOKUP($A206,'Style navne sprog'!$A:$I,7,FALSE)))))))","v":"Backpack | canvas"},{"$f":"IF(Master!C206<>\"\",Master!C206*Selection!$B$3,\"\")","v":88.300000000000011},{"$f":"IF(Master!D206<>\"\",Master!D206*Selection!$B$3,\"\")","v":""},"",{"$f":"IF(Master!F206<>\"\",Master!F206*Selection!$B$3,\"\")","v":""},{"$f":"IF(Factor!#REF!<>\"\",Factor!#REF!*Selection!$B$3,\"\")","v":{"$error":"#REF!"}}]
["1821",{"$f":"IF(Selection!$B$4=\"DK\",VLOOKUP($A207,'Style navne sprog'!$A:$I,6,FALSE),IF(Selection!$B$4=\"DE\",VLOOKUP($A207,'Style navne sprog'!$A:$I,2,FALSE),IF(Selection!$B$4=\"GB\",VLOOKUP($A207,'Style navne sprog'!$A:$I,4,FALSE),IF(Selection!$B$4=\"SE\",VLOOKUP($A207,'Style navne sprog'!$A:$I,3,FALSE),IF(Selection!$B$4=\"NO\",VLOOKUP($A207,'Style navne sprog'!$A:$I,5,FALSE),IF(Selection!$B$4=\"PL\",VLOOKUP($A207,'Style navne sprog'!$A:$I,7,FALSE)))))))","v":"Shopping bag | canvas"},{"$f":"IF(Master!C207<>\"\",Master!C207*Selection!$B$3,\"\")","v":48.1},{"$f":"IF(Master!D207<>\"\",Master!D207*Selection!$B$3,\"\")","v":""},"",{"$f":"IF(Master!F207<>\"\",Master!F207*Selection!$B$3,\"\")","v":""},{"$f":"IF(Factor!#REF!<>\"\",Factor!#REF!*Selection!$B$3,\"\")","v":{"$error":"#REF!"}}]
["1825",{"$f":"IF(Selection!$B$4=\"DK\",VLOOKUP($A208,'Style navne sprog'!$A:$I,6,FALSE),IF(Selection!$B$4=\"DE\",VLOOKUP($A208,'Style navne sprog'!$A:$I,2,FALSE),IF(Selection!$B$4=\"GB\",VLOOKUP($A208,'Style navne sprog'!$A:$I,4,FALSE),IF(Selection!$B$4=\"SE\",VLOOKUP($A208,'Style navne sprog'!$A:$I,3,FALSE),IF(Selection!$B$4=\"NO\",VLOOKUP($A208,'Style navne sprog'!$A:$I,5,FALSE),IF(Selection!$B$4=\"PL\",VLOOKUP($A208,'Style navne sprog'!$A:$I,7,FALSE)))))))","v":"Ripstop sports bag"},{"$f":"IF(Master!C208<>\"\",Master!C208*Selection!$B$3,\"\")","v":70.2},{"$f":"IF(Master!D208<>\"\",Master!D208*Selection!$B$3,\"\")","v":""},"",{"$f":"IF(Master!F208<>\"\",Master!F208*Selection!$B$3,\"\")","v":""},{"$f":"IF(Factor!#REF!<>\"\",Factor!#REF!*Selection!$B$3,\"\")","v":{"$error":"#REF!"}}]
["1850",{"$f":"IF(Selection!$B$4=\"DK\",VLOOKUP($A209,'Style navne sprog'!$A:$I,6,FALSE),IF(Selection!$B$4=\"DE\",VLOOKUP($A209,'Style navne sprog'!$A:$I,2,FALSE),IF(Selection!$B$4=\"GB\",VLOOKUP($A209,'Style navne sprog'!$A:$I,4,FALSE),IF(Selection!$B$4=\"SE\",VLOOKUP($A209,'Style navne sprog'!$A:$I,3,FALSE),IF(Selection!$B$4=\"NO\",VLOOKUP($A209,'Style navne sprog'!$A:$I,5,FALSE),IF(Selection!$B$4=\"PL\",VLOOKUP($A209,'Style navne sprog'!$A:$I,7,FALSE)))))))","v":"Gym bag | backpack"},{"$f":"IF(Master!C209<>\"\",Master!C209*Selection!$B$3,\"\")","v":9.7000000000000011},{"$f":"IF(Master!D209<>\"\",Master!D209*Selection!$B$3,\"\")","v":""},"",{"$f":"IF(Master!F209<>\"\",Master!F209*Selection!$B$3,\"\")","v":""},{"$f":"IF(Factor!#REF!<>\"\",Factor!#REF!*Selection!$B$3,\"\")","v":{"$error":"#REF!"}}]
["1864",{"$f":"IF(Selection!$B$4=\"DK\",VLOOKUP($A210,'Style navne sprog'!$A:$I,6,FALSE),IF(Selection!$B$4=\"DE\",VLOOKUP($A210,'Style navne sprog'!$A:$I,2,FALSE),IF(Selection!$B$4=\"GB\",VLOOKUP($A210,'Style navne sprog'!$A:$I,4,FALSE),IF(Selection!$B$4=\"SE\",VLOOKUP($A210,'Style navne sprog'!$A:$I,3,FALSE),IF(Selection!$B$4=\"NO\",VLOOKUP($A210,'Style navne sprog'!$A:$I,5,FALSE),IF(Selection!$B$4=\"PL\",VLOOKUP($A210,'Style navne sprog'!$A:$I,7,FALSE)))))))","v":"Computer bag"},{"$f":"IF(Master!C210<>\"\",Master!C210*Selection!$B$3,\"\")","v":96},{"$f":"IF(Master!D210<>\"\",Master!D210*Selection!$B$3,\"\")","v":""},"",{"$f":"IF(Master!F210<>\"\",Master!F210*Selection!$B$3,\"\")","v":""},{"$f":"IF(Factor!#REF!<>\"\",Factor!#REF!*Selection!$B$3,\"\")","v":{"$error":"#REF!"}}]
["1880",{"$f":"IF(Selection!$B$4=\"DK\",VLOOKUP($A211,'Style navne sprog'!$A:$I,6,FALSE),IF(Selection!$B$4=\"DE\",VLOOKUP($A211,'Style navne sprog'!$A:$I,2,FALSE),IF(Selection!$B$4=\"GB\",VLOOKUP($A211,'Style navne sprog'!$A:$I,4,FALSE),IF(Selection!$B$4=\"SE\",VLOOKUP($A211,'Style navne sprog'!$A:$I,3,FALSE),IF(Selection!$B$4=\"NO\",VLOOKUP($A211,'Style navne sprog'!$A:$I,5,FALSE),IF(Selection!$B$4=\"PL\",VLOOKUP($A211,'Style navne sprog'!$A:$I,7,FALSE)))))))","v":"Shopping basket"},{"$f":"IF(Master!C211<>\"\",Master!C211*Selection!$B$3,\"\")","v":34.800000000000004},{"$f":"IF(Master!D211<>\"\",Master!D211*Selection!$B$3,\"\")","v":""},"",{"$f":"IF(Master!F211<>\"\",Master!F211*Selection!$B$3,\"\")","v":""},{"$f":"IF(Factor!#REF!<>\"\",Factor!#REF!*Selection!$B$3,\"\")","v":{"$error":"#REF!"}}]
["1900",{"$f":"IF(Selection!$B$4=\"DK\",VLOOKUP($A212,'Style navne sprog'!$A:$I,6,FALSE),IF(Selection!$B$4=\"DE\",VLOOKUP($A212,'Style navne sprog'!$A:$I,2,FALSE),IF(Selection!$B$4=\"GB\",VLOOKUP($A212,'Style navne sprog'!$A:$I,4,FALSE),IF(Selection!$B$4=\"SE\",VLOOKUP($A212,'Style navne sprog'!$A:$I,3,FALSE),IF(Selection!$B$4=\"NO\",VLOOKUP($A212,'Style navne sprog'!$A:$I,5,FALSE),IF(Selection!$B$4=\"PL\",VLOOKUP($A212,'Style navne sprog'!$A:$I,7,FALSE)))))))","v":"Worker vest | EN 20471"},{"$f":"IF(Master!C212<>\"\",Master!C212*Selection!$B$3,\"\")","v":13.3},{"$f":"IF(Master!D212<>\"\",Master!D212*Selection!$B$3,\"\")","v":""},"",{"$f":"IF(Master!F212<>\"\",Master!F212*Selection!$B$3,\"\")","v":""},{"$f":"IF(Factor!#REF!<>\"\",Factor!#REF!*Selection!$B$3,\"\")","v":{"$error":"#REF!"}}]
["1915",{"$f":"IF(Selection!$B$4=\"DK\",VLOOKUP($A213,'Style navne sprog'!$A:$I,6,FALSE),IF(Selection!$B$4=\"DE\",VLOOKUP($A213,'Style navne sprog'!$A:$I,2,FALSE),IF(Selection!$B$4=\"GB\",VLOOKUP($A213,'Style navne sprog'!$A:$I,4,FALSE),IF(Selection!$B$4=\"SE\",VLOOKUP($A213,'Style navne sprog'!$A:$I,3,FALSE),IF(Selection!$B$4=\"NO\",VLOOKUP($A213,'Style navne sprog'!$A:$I,5,FALSE),IF(Selection!$B$4=\"PL\",VLOOKUP($A213,'Style navne sprog'!$A:$I,7,FALSE)))))))","v":"Runner’s vest"},{"$f":"IF(Master!C213<>\"\",Master!C213*Selection!$B$3,\"\")","v":47.7},{"$f":"IF(Master!D213<>\"\",Master!D213*Selection!$B$3,\"\")","v":""},"",{"$f":"IF(Master!F213<>\"\",Master!F213*Selection!$B$3,\"\")","v":""},{"$f":"IF(Factor!#REF!<>\"\",Factor!#REF!*Selection!$B$3,\"\")","v":{"$error":"#REF!"}}]
[]
["SPORT | GEYSER"]
["G11006",{"$f":"IF(Selection!$B$4=\"DK\",VLOOKUP($A216,'Style navne sprog'!$A:$I,6,FALSE),IF(Selection!$B$4=\"DE\",VLOOKUP($A216,'Style navne sprog'!$A:$I,2,FALSE),IF(Selection!$B$4=\"GB\",VLOOKUP($A216,'Style navne sprog'!$A:$I,4,FALSE),IF(Selection!$B$4=\"SE\",VLOOKUP($A216,'Style navne sprog'!$A:$I,3,FALSE),IF(Selection!$B$4=\"NO\",VLOOKUP($A216,'Style navne sprog'!$A:$I,5,FALSE),IF(Selection!$B$4=\"PL\",VLOOKUP($A216,'Style navne sprog'!$A:$I,7,FALSE)))))))","v":"GEYSER polo shirt | functional | women"},{"$f":"IF(Master!C216<>\"\",Master!C216*Selection!$B$3,\"\")","v":68.2},{"$f":"IF(Master!D216<>\"\",Master!D216*Selection!$B$3,\"\")","v":""},"",{"$f":"IF(Master!F216<>\"\",Master!F216*Selection!$B$3,\"\")","v":""},{"$f":"IF(Factor!#REF!<>\"\",Factor!#REF!*Selection!$B$3,\"\")","v":{"$error":"#REF!"}}]
["G11020",{"$f":"IF(Selection!$B$4=\"DK\",VLOOKUP($A217,'Style navne sprog'!$A:$I,6,FALSE),IF(Selection!$B$4=\"DE\",VLOOKUP($A217,'Style navne sprog'!$A:$I,2,FALSE),IF(Selection!$B$4=\"GB\",VLOOKUP($A217,'Style navne sprog'!$A:$I,4,FALSE),IF(Selection!$B$4=\"SE\",VLOOKUP($A217,'Style navne sprog'!$A:$I,3,FALSE),IF(Selection!$B$4=\"NO\",VLOOKUP($A217,'Style navne sprog'!$A:$I,5,FALSE),IF(Selection!$B$4=\"PL\",VLOOKUP($A217,'Style navne sprog'!$A:$I,7,FALSE)))))))","v":"GEYSER T-shirt | seamless | women"},{"$f":"IF(Master!C217<>\"\",Master!C217*Selection!$B$3,\"\")","v":54.5},{"$f":"IF(Master!D217<>\"\",Master!D217*Selection!$B$3,\"\")","v":""},"",{"$f":"IF(Master!F217<>\"\",Master!F217*Selection!$B$3,\"\")","v":""},{"$f":"IF(Factor!#REF!<>\"\",Factor!#REF!*Selection!$B$3,\"\")","v":{"$error":"#REF!"}}]
["G11021",{"$f":"IF(Selection!$B$4=\"DK\",VLOOKUP($A218,'Style navne sprog'!$A:$I,6,FALSE),IF(Selection!$B$4=\"DE\",VLOOKUP($A218,'Style navne sprog'!$A:$I,2,FALSE),IF(Selection!$B$4=\"GB\",VLOOKUP($A218,'Style navne sprog'!$A:$I,4,FALSE),IF(Selection!$B$4=\"SE\",VLOOKUP($A218,'Style navne sprog'!$A:$I,3,FALSE),IF(Selection!$B$4=\"NO\",VLOOKUP($A218,'Style navne sprog'!$A:$I,5,FALSE),IF(Selection!$B$4=\"PL\",VLOOKUP($A218,'Style navne sprog'!$A:$I,7,FALSE)))))))","v":"GEYSER long-sleeved T-shirt | seamless | women"},{"$f":"IF(Master!C218<>\"\",Master!C218*Selection!$B$3,\"\")","v":62.300000000000004},{"$f":"IF(Master!D218<>\"\",Master!D218*Selection!$B$3,\"\")","v":""},"",{"$f":"IF(Master!F218<>\"\",Master!F218*Selection!$B$3,\"\")","v":""},{"$f":"IF(Factor!#REF!<>\"\",Factor!#REF!*Selection!$B$3,\"\")","v":{"$error":"#REF!"}}]
["G11024",{"$f":"IF(Selection!$B$4=\"DK\",VLOOKUP($A219,'Style navne sprog'!$A:$I,6,FALSE),IF(Selection!$B$4=\"DE\",VLOOKUP($A219,'Style navne sprog'!$A:$I,2,FALSE),IF(Selection!$B$4=\"GB\",VLOOKUP($A219,'Style navne sprog'!$A:$I,4,FALSE),IF(Selection!$B$4=\"SE\",VLOOKUP($A219,'Style navne sprog'!$A:$I,3,FALSE),IF(Selection!$B$4=\"NO\",VLOOKUP($A219,'Style navne sprog'!$A:$I,5,FALSE),IF(Selection!$B$4=\"PL\",VLOOKUP($A219,'Style navne sprog'!$A:$I,7,FALSE)))))))","v":"GEYSER striped T-shirt | seamless | women"},{"$f":"IF(Master!C219<>\"\",Master!C219*Selection!$B$3,\"\")","v":54.5},{"$f":"IF(Master!D219<>\"\",Master!D219*Selection!$B$3,\"\")","v":""},"",{"$f":"IF(Master!F219<>\"\",Master!F219*Selection!$B$3,\"\")","v":""},{"$f":"IF(Factor!#REF!<>\"\",Factor!#REF!*Selection!$B$3,\"\")","v":{"$error":"#REF!"}}]
["G11032",{"$f":"IF(Selection!$B$4=\"DK\",VLOOKUP($A220,'Style navne sprog'!$A:$I,6,FALSE),IF(Selection!$B$4=\"DE\",VLOOKUP($A220,'Style navne sprog'!$A:$I,2,FALSE),IF(Selection!$B$4=\"GB\",VLOOKUP($A220,'Style navne sprog'!$A:$I,4,FALSE),IF(Selection!$B$4=\"SE\",VLOOKUP($A220,'Style navne sprog'!$A:$I,3,FALSE),IF(Selection!$B$4=\"NO\",VLOOKUP($A220,'Style navne sprog'!$A:$I,5,FALSE),IF(Selection!$B$4=\"PL\",VLOOKUP($A220,'Style navne sprog'!$A:$I,7,FALSE)))))))","v":"GEYSER hybrid jacket | women"},{"$f":"IF(Master!C220<>\"\",Master!C220*Selection!$B$3,\"\")","v":142.1},{"$f":"IF(Master!D220<>\"\",Master!D220*Selection!$B$3,\"\")","v":""},"",{"$f":"IF(Master!F220<>\"\",Master!F220*Selection!$B$3,\"\")","v":""},{"$f":"IF(Factor!#REF!<>\"\",Factor!#REF!*Selection!$B$3,\"\")","v":{"$error":"#REF!"}}]
["G11033",{"$f":"IF(Selection!$B$4=\"DK\",VLOOKUP($A221,'Style navne sprog'!$A:$I,6,FALSE),IF(Selection!$B$4=\"DE\",VLOOKUP($A221,'Style navne sprog'!$A:$I,2,FALSE),IF(Selection!$B$4=\"GB\",VLOOKUP($A221,'Style navne sprog'!$A:$I,4,FALSE),IF(Selection!$B$4=\"SE\",VLOOKUP($A221,'Style navne sprog'!$A:$I,3,FALSE),IF(Selection!$B$4=\"NO\",VLOOKUP($A221,'Style navne sprog'!$A:$I,5,FALSE),IF(Selection!$B$4=\"PL\",VLOOKUP($A221,'Style navne sprog'!$A:$I,7,FALSE)))))))","v":"GEYSER hybrid vest | women"},{"$f":"IF(Master!C221<>\"\",Master!C221*Selection!$B$3,\"\")","v":115.30000000000001},{"$f":"IF(Master!D221<>\"\",Master!D221*Selection!$B$3,\"\")","v":""},"",{"$f":"IF(Master!F221<>\"\",Master!F221*Selection!$B$3,\"\")","v":""},{"$f":"IF(Factor!#REF!<>\"\",Factor!#REF!*Selection!$B$3,\"\")","v":{"$error":"#REF!"}}]
["G11036",{"$f":"IF(Selection!$B$4=\"DK\",VLOOKUP($A222,'Style navne sprog'!$A:$I,6,FALSE),IF(Selection!$B$4=\"DE\",VLOOKUP($A222,'Style navne sprog'!$A:$I,2,FALSE),IF(Selection!$B$4=\"GB\",VLOOKUP($A222,'Style navne sprog'!$A:$I,4,FALSE),IF(Selection!$B$4=\"SE\",VLOOKUP($A222,'Style navne sprog'!$A:$I,3,FALSE),IF(Selection!$B$4=\"NO\",VLOOKUP($A222,'Style navne sprog'!$A:$I,5,FALSE),IF(Selection!$B$4=\"PL\",VLOOKUP($A222,'Style navne sprog'!$A:$I,7,FALSE)))))))","v":"GEYSER active pants | stretch | women"},{"$f":"IF(Master!C222<>\"\",Master!C222*Selection!$B$3,\"\")","v":95.4},{"$f":"IF(Master!D222<>\"\",Master!D222*Selection!$B$3,\"\")","v":""},"",{"$f":"IF(Master!F222<>\"\",Master!F222*Selection!$B$3,\"\")","v":""},{"$f":"IF(Factor!#REF!<>\"\",Factor!#REF!*Selection!$B$3,\"\")","v":{"$error":"#REF!"}}]
["G11040",{"$f":"IF(Selection!$B$4=\"DK\",VLOOKUP($A223,'Style navne sprog'!$A:$I,6,FALSE),IF(Selection!$B$4=\"DE\",VLOOKUP($A223,'Style navne sprog'!$A:$I,2,FALSE),IF(Selection!$B$4=\"GB\",VLOOKUP($A223,'Style navne sprog'!$A:$I,4,FALSE),IF(Selection!$B$4=\"SE\",VLOOKUP($A223,'Style navne sprog'!$A:$I,3,FALSE),IF(Selection!$B$4=\"NO\",VLOOKUP($A223,'Style navne sprog'!$A:$I,5,FALSE),IF(Selection!$B$4=\"PL\",VLOOKUP($A223,'Style navne sprog'!$A:$I,7,FALSE)))))))","v":"GEYSER T-shirt | essential | women"},{"$f":"IF(Master!C223<>\"\",Master!C223*Selection!$B$3,\"\")","v":40},{"$f":"IF(Master!D223<>\"\",Master!D223*Selection!$B$3,\"\")","v":""},"",{"$f":"IF(Master!F223<>\"\",Master!F223*Selection!$B$3,\"\")","v":""},{"$f":"IF(Factor!#REF!<>\"\",Factor!#REF!*Selection!$B$3,\"\")","v":{"$error":"#REF!"}}]
["G11048",{"$f":"IF(Selection!$B$4=\"DK\",VLOOKUP($A224,'Style navne sprog'!$A:$I,6,FALSE),IF(Selection!$B$4=\"DE\",VLOOKUP($A224,'Style navne sprog'!$A:$I,2,FALSE),IF(Selection!$B$4=\"GB\",VLOOKUP($A224,'Style navne sprog'!$A:$I,4,FALSE),IF(Selection!$B$4=\"SE\",VLOOKUP($A224,'Style navne sprog'!$A:$I,3,FALSE),IF(Selection!$B$4=\"NO\",VLOOKUP($A224,'Style navne sprog'!$A:$I,5,FALSE),IF(Selection!$B$4=\"PL\",VLOOKUP($A224,'Style navne sprog'!$A:$I,7,FALSE)))))))","v":"GEYSER performance tights | long | women"},{"$f":"IF(Master!C224<>\"\",Master!C224*Selection!$B$3,\"\")","v":81.100000000000009},{"$f":"IF(Master!D224<>\"\",Master!D224*Selection!$B$3,\"\")","v":""},"",{"$f":"IF(Master!F224<>\"\",Master!F224*Selection!$B$3,\"\")","v":""},{"$f":"IF(Factor!#REF!<>\"\",Factor!#REF!*Selection!$B$3,\"\")","v":{"$error":"#REF!"}}]
["G11049",{"$f":"IF(Selection!$B$4=\"DK\",VLOOKUP($A225,'Style navne sprog'!$A:$I,6,FALSE),IF(Selection!$B$4=\"DE\",VLOOKUP($A225,'Style navne sprog'!$A:$I,2,FALSE),IF(Selection!$B$4=\"GB\",VLOOKUP($A225,'Style navne sprog'!$A:$I,4,FALSE),IF(Selection!$B$4=\"SE\",VLOOKUP($A225,'Style navne sprog'!$A:$I,3,FALSE),IF(Selection!$B$4=\"NO\",VLOOKUP($A225,'Style navne sprog'!$A:$I,5,FALSE),IF(Selection!$B$4=\"PL\",VLOOKUP($A225,'Style navne sprog'!$A:$I,7,FALSE)))))))","v":"GEYSER performance tights | short | women"},{"$f":"IF(Master!C225<>\"\",Master!C225*Selection!$B$3,\"\")","v":62.300000000000004},{"$f":"IF(Master!D225<>\"\",Master!D225*Selection!$B$3,\"\")","v":""},"",{"$f":"IF(Master!F225<>\"\",Master!F225*Selection!$B$3,\"\")","v":""},{"$f":"IF(Factor!#REF!<>\"\",Factor!#REF!*Selection!$B$3,\"\")","v":{"$error":"#REF!"}}]
["G11070",{"$f":"IF(Selection!$B$4=\"DK\",VLOOKUP($A226,'Style navne sprog'!$A:$I,6,FALSE),IF(Selection!$B$4=\"DE\",VLOOKUP($A226,'Style navne sprog'!$A:$I,2,FALSE),IF(Selection!$B$4=\"GB\",VLOOKUP($A226,'Style navne sprog'!$A:$I,4,FALSE),IF(Selection!$B$4=\"SE\",VLOOKUP($A226,'Style navne sprog'!$A:$I,3,FALSE),IF(Selection!$B$4=\"NO\",VLOOKUP($A226,'Style navne sprog'!$A:$I,5,FALSE),IF(Selection!$B$4=\"PL\",VLOOKUP($A226,'Style navne sprog'!$A:$I,7,FALSE)))))))","v":"GEYSER winter jacket | women"},{"$f":"IF(Master!C226<>\"\",Master!C226*Selection!$B$3,\"\")","v":249.4},{"$f":"IF(Master!D226<>\"\",Master!D226*Selection!$B$3,\"\")","v":""},"",{"$f":"IF(Master!F226<>\"\",Master!F226*Selection!$B$3,\"\")","v":""},{"$f":"IF(Factor!#REF!<>\"\",Factor!#REF!*Selection!$B$3,\"\")","v":{"$error":"#REF!"}}]
["G11080",{"$f":"IF(Selection!$B$4=\"DK\",VLOOKUP($A227,'Style navne sprog'!$A:$I,6,FALSE),IF(Selection!$B$4=\"DE\",VLOOKUP($A227,'Style navne sprog'!$A:$I,2,FALSE),IF(Selection!$B$4=\"GB\",VLOOKUP($A227,'Style navne sprog'!$A:$I,4,FALSE),IF(Selection!$B$4=\"SE\",VLOOKUP($A227,'Style navne sprog'!$A:$I,3,FALSE),IF(Selection!$B$4=\"NO\",VLOOKUP($A227,'Style navne sprog'!$A:$I,5,FALSE),IF(Selection!$B$4=\"PL\",VLOOKUP($A227,'Style navne sprog'!$A:$I,7,FALSE)))))))","v":"GEYSER stretch hoodie | women"},{"$f":"IF(Master!C227<>\"\",Master!C227*Selection!$B$3,\"\")","v":134.1},{"$f":"IF(Master!D227<>\"\",Master!D227*Selection!$B$3,\"\")","v":""},"",{"$f":"IF(Master!F227<>\"\",Master!F227*Selection!$B$3,\"\")","v":""},{"$f":"IF(Factor!#REF!<>\"\",Factor!#REF!*Selection!$B$3,\"\")","v":{"$error":"#REF!"}}]
["G11090",{"$f":"IF(Selection!$B$4=\"DK\",VLOOKUP($A228,'Style navne sprog'!$A:$I,6,FALSE),IF(Selection!$B$4=\"DE\",VLOOKUP($A228,'Style navne sprog'!$A:$I,2,FALSE),IF(Selection!$B$4=\"GB\",VLOOKUP($A228,'Style navne sprog'!$A:$I,4,FALSE),IF(Selection!$B$4=\"SE\",VLOOKUP($A228,'Style navne sprog'!$A:$I,3,FALSE),IF(Selection!$B$4=\"NO\",VLOOKUP($A228,'Style navne sprog'!$A:$I,5,FALSE),IF(Selection!$B$4=\"PL\",VLOOKUP($A228,'Style navne sprog'!$A:$I,7,FALSE)))))))","v":"GEYSER stretch trainer | ¼ zip | women"},{"$f":"IF(Master!C228<>\"\",Master!C228*Selection!$B$3,\"\")","v":107.2},{"$f":"IF(Master!D228<>\"\",Master!D228*Selection!$B$3,\"\")","v":""},"",{"$f":"IF(Master!F228<>\"\",Master!F228*Selection!$B$3,\"\")","v":""},{"$f":"IF(Factor!#REF!<>\"\",Factor!#REF!*Selection!$B$3,\"\")","v":{"$error":"#REF!"}}]
["G21006",{"$f":"IF(Selection!$B$4=\"DK\",VLOOKUP($A229,'Style navne sprog'!$A:$I,6,FALSE),IF(Selection!$B$4=\"DE\",VLOOKUP($A229,'Style navne sprog'!$A:$I,2,FALSE),IF(Selection!$B$4=\"GB\",VLOOKUP($A229,'Style navne sprog'!$A:$I,4,FALSE),IF(Selection!$B$4=\"SE\",VLOOKUP($A229,'Style navne sprog'!$A:$I,3,FALSE),IF(Selection!$B$4=\"NO\",VLOOKUP($A229,'Style navne sprog'!$A:$I,5,FALSE),IF(Selection!$B$4=\"PL\",VLOOKUP($A229,'Style navne sprog'!$A:$I,7,FALSE)))))))","v":"GEYSER polo shirt | functional"},{"$f":"IF(Master!C229<>\"\",Master!C229*Selection!$B$3,\"\")","v":68.2},{"$f":"IF(Master!D229<>\"\",Master!D229*Selection!$B$3,\"\")","v":""},"",{"$f":"IF(Master!F229<>\"\",Master!F229*Selection!$B$3,\"\")","v":""},{"$f":"IF(Factor!#REF!<>\"\",Factor!#REF!*Selection!$B$3,\"\")","v":{"$error":"#REF!"}}]
["G21015",{"$f":"IF(Selection!$B$4=\"DK\",VLOOKUP($A230,'Style navne sprog'!$A:$I,6,FALSE),IF(Selection!$B$4=\"DE\",VLOOKUP($A230,'Style navne sprog'!$A:$I,2,FALSE),IF(Selection!$B$4=\"GB\",VLOOKUP($A230,'Style navne sprog'!$A:$I,4,FALSE),IF(Selection!$B$4=\"SE\",VLOOKUP($A230,'Style navne sprog'!$A:$I,3,FALSE),IF(Selection!$B$4=\"NO\",VLOOKUP($A230,'Style navne sprog'!$A:$I,5,FALSE),IF(Selection!$B$4=\"PL\",VLOOKUP($A230,'Style navne sprog'!$A:$I,7,FALSE)))))))","v":"GEYSER sporty training pants"},{"$f":"IF(Master!C230<>\"\",Master!C230*Selection!$B$3,\"\")","v":124.7},{"$f":"IF(Master!D230<>\"\",Master!D230*Selection!$B$3,\"\")","v":""},"",{"$f":"IF(Master!F230<>\"\",Master!F230*Selection!$B$3,\"\")","v":""},{"$f":"IF(Factor!#REF!<>\"\",Factor!#REF!*Selection!$B$3,\"\")","v":{"$error":"#REF!"}}]
["G21020",{"$f":"IF(Selection!$B$4=\"DK\",VLOOKUP($A231,'Style navne sprog'!$A:$I,6,FALSE),IF(Selection!$B$4=\"DE\",VLOOKUP($A231,'Style navne sprog'!$A:$I,2,FALSE),IF(Selection!$B$4=\"GB\",VLOOKUP($A231,'Style navne sprog'!$A:$I,4,FALSE),IF(Selection!$B$4=\"SE\",VLOOKUP($A231,'Style navne sprog'!$A:$I,3,FALSE),IF(Selection!$B$4=\"NO\",VLOOKUP($A231,'Style navne sprog'!$A:$I,5,FALSE),IF(Selection!$B$4=\"PL\",VLOOKUP($A231,'Style navne sprog'!$A:$I,7,FALSE)))))))","v":"GEYSER T-shirt | seamless"},{"$f":"IF(Master!C231<>\"\",Master!C231*Selection!$B$3,\"\")","v":54.5},{"$f":"IF(Master!D231<>\"\",Master!D231*Selection!$B$3,\"\")","v":""},"",{"$f":"IF(Master!F231<>\"\",Master!F231*Selection!$B$3,\"\")","v":""},{"$f":"IF(Factor!#REF!<>\"\",Factor!#REF!*Selection!$B$3,\"\")","v":{"$error":"#REF!"}}]
["G21021",{"$f":"IF(Selection!$B$4=\"DK\",VLOOKUP($A232,'Style navne sprog'!$A:$I,6,FALSE),IF(Selection!$B$4=\"DE\",VLOOKUP($A232,'Style navne sprog'!$A:$I,2,FALSE),IF(Selection!$B$4=\"GB\",VLOOKUP($A232,'Style navne sprog'!$A:$I,4,FALSE),IF(Selection!$B$4=\"SE\",VLOOKUP($A232,'Style navne sprog'!$A:$I,3,FALSE),IF(Selection!$B$4=\"NO\",VLOOKUP($A232,'Style navne sprog'!$A:$I,5,FALSE),IF(Selection!$B$4=\"PL\",VLOOKUP($A232,'Style navne sprog'!$A:$I,7,FALSE)))))))","v":"GEYSER long-sleeved T-shirt | seamless"},{"$f":"IF(Master!C232<>\"\",Master!C232*Selection!$B$3,\"\")","v":62.300000000000004},{"$f":"IF(Master!D232<>\"\",Master!D232*Selection!$B$3,\"\")","v":""},"",{"$f":"IF(Master!F232<>\"\",Master!F232*Selection!$B$3,\"\")","v":""},{"$f":"IF(Factor!#REF!<>\"\",Factor!#REF!*Selection!$B$3,\"\")","v":{"$error":"#REF!"}}]
["G21024",{"$f":"IF(Selection!$B$4=\"DK\",VLOOKUP($A233,'Style navne sprog'!$A:$I,6,FALSE),IF(Selection!$B$4=\"DE\",VLOOKUP($A233,'Style navne sprog'!$A:$I,2,FALSE),IF(Selection!$B$4=\"GB\",VLOOKUP($A233,'Style navne sprog'!$A:$I,4,FALSE),IF(Selection!$B$4=\"SE\",VLOOKUP($A233,'Style navne sprog'!$A:$I,3,FALSE),IF(Selection!$B$4=\"NO\",VLOOKUP($A233,'Style navne sprog'!$A:$I,5,FALSE),IF(Selection!$B$4=\"PL\",VLOOKUP($A233,'Style navne sprog'!$A:$I,7,FALSE)))))))","v":"GEYSER striped T-shirt | seamless"},{"$f":"IF(Master!C233<>\"\",Master!C233*Selection!$B$3,\"\")","v":54.5},{"$f":"IF(Master!D233<>\"\",Master!D233*Selection!$B$3,\"\")","v":""},"",{"$f":"IF(Master!F233<>\"\",Master!F233*Selection!$B$3,\"\")","v":""},{"$f":"IF(Factor!#REF!<>\"\",Factor!#REF!*Selection!$B$3,\"\")","v":{"$error":"#REF!"}}]
["G21032",{"$f":"IF(Selection!$B$4=\"DK\",VLOOKUP($A234,'Style navne sprog'!$A:$I,6,FALSE),IF(Selection!$B$4=\"DE\",VLOOKUP($A234,'Style navne sprog'!$A:$I,2,FALSE),IF(Selection!$B$4=\"GB\",VLOOKUP($A234,'Style navne sprog'!$A:$I,4,FALSE),IF(Selection!$B$4=\"SE\",VLOOKUP($A234,'Style navne sprog'!$A:$I,3,FALSE),IF(Selection!$B$4=\"NO\",VLOOKUP($A234,'Style navne sprog'!$A:$I,5,FALSE),IF(Selection!$B$4=\"PL\",VLOOKUP($A234,'Style navne sprog'!$A:$I,7,FALSE)))))))","v":"GEYSER hybrid jacket"},{"$f":"IF(Master!C234<>\"\",Master!C234*Selection!$B$3,\"\")","v":142.1},{"$f":"IF(Master!D234<>\"\",Master!D234*Selection!$B$3,\"\")","v":""},"",{"$f":"IF(Master!F234<>\"\",Master!F234*Selection!$B$3,\"\")","v":""},{"$f":"IF(Factor!#REF!<>\"\",Factor!#REF!*Selection!$B$3,\"\")","v":{"$error":"#REF!"}}]
["G21033",{"$f":"IF(Selection!$B$4=\"DK\",VLOOKUP($A235,'Style navne sprog'!$A:$I,6,FALSE),IF(Selection!$B$4=\"DE\",VLOOKUP($A235,'Style navne sprog'!$A:$I,2,FALSE),IF(Selection!$B$4=\"GB\",VLOOKUP($A235,'Style navne sprog'!$A:$I,4,FALSE),IF(Selection!$B$4=\"SE\",VLOOKUP($A235,'Style navne sprog'!$A:$I,3,FALSE),IF(Selection!$B$4=\"NO\",VLOOKUP($A235,'Style navne sprog'!$A:$I,5,FALSE),IF(Selection!$B$4=\"PL\",VLOOKUP($A235,'Style navne sprog'!$A:$I,7,FALSE)))))))","v":"GEYSER hybrid vest"},{"$f":"IF(Master!C235<>\"\",Master!C235*Selection!$B$3,\"\")","v":115.30000000000001},{"$f":"IF(Master!D235<>\"\",Master!D235*Selection!$B$3,\"\")","v":""},"",{"$f":"IF(Master!F235<>\"\",Master!F235*Selection!$B$3,\"\")","v":""},{"$f":"IF(Factor!#REF!<>\"\",Factor!#REF!*Selection!$B$3,\"\")","v":{"$error":"#REF!"}}]
["G21034",{"$f":"IF(Selection!$B$4=\"DK\",VLOOKUP($A236,'Style navne sprog'!$A:$I,6,FALSE),IF(Selection!$B$4=\"DE\",VLOOKUP($A236,'Style navne sprog'!$A:$I,2,FALSE),IF(Selection!$B$4=\"GB\",VLOOKUP($A236,'Style navne sprog'!$A:$I,4,FALSE),IF(Selection!$B$4=\"SE\",VLOOKUP($A236,'Style navne sprog'!$A:$I,3,FALSE),IF(Selection!$B$4=\"NO\",VLOOKUP($A236,'Style navne sprog'!$A:$I,5,FALSE),IF(Selection!$B$4=\"PL\",VLOOKUP($A236,'Style navne sprog'!$A:$I,7,FALSE)))))))","v":"GEYSER active shorts | stretch"},{"$f":"IF(Master!C236<>\"\",Master!C236*Selection!$B$3,\"\")","v":81.900000000000006},{"$f":"IF(Master!D236<>\"\",Master!D236*Selection!$B$3,\"\")","v":""},"",{"$f":"IF(Master!F236<>\"\",Master!F236*Selection!$B$3,\"\")","v":""},{"$f":"IF(Factor!#REF!<>\"\",Factor!#REF!*Selection!$B$3,\"\")","v":{"$error":"#REF!"}}]
["G21036",{"$f":"IF(Selection!$B$4=\"DK\",VLOOKUP($A237,'Style navne sprog'!$A:$I,6,FALSE),IF(Selection!$B$4=\"DE\",VLOOKUP($A237,'Style navne sprog'!$A:$I,2,FALSE),IF(Selection!$B$4=\"GB\",VLOOKUP($A237,'Style navne sprog'!$A:$I,4,FALSE),IF(Selection!$B$4=\"SE\",VLOOKUP($A237,'Style navne sprog'!$A:$I,3,FALSE),IF(Selection!$B$4=\"NO\",VLOOKUP($A237,'Style navne sprog'!$A:$I,5,FALSE),IF(Selection!$B$4=\"PL\",VLOOKUP($A237,'Style navne sprog'!$A:$I,7,FALSE)))))))","v":"GEYSER active pants | stretch"},{"$f":"IF(Master!C237<>\"\",Master!C237*Selection!$B$3,\"\")","v":95.4},{"$f":"IF(Master!D237<>\"\",Master!D237*Selection!$B$3,\"\")","v":""},"",{"$f":"IF(Master!F237<>\"\",Master!F237*Selection!$B$3,\"\")","v":""},{"$f":"IF(Factor!#REF!<>\"\",Factor!#REF!*Selection!$B$3,\"\")","v":{"$error":"#REF!"}}]
["G21040",{"$f":"IF(Selection!$B$4=\"DK\",VLOOKUP($A238,'Style navne sprog'!$A:$I,6,FALSE),IF(Selection!$B$4=\"DE\",VLOOKUP($A238,'Style navne sprog'!$A:$I,2,FALSE),IF(Selection!$B$4=\"GB\",VLOOKUP($A238,'Style navne sprog'!$A:$I,4,FALSE),IF(Selection!$B$4=\"SE\",VLOOKUP($A238,'Style navne sprog'!$A:$I,3,FALSE),IF(Selection!$B$4=\"NO\",VLOOKUP($A238,'Style navne sprog'!$A:$I,5,FALSE),IF(Selection!$B$4=\"PL\",VLOOKUP($A238,'Style navne sprog'!$A:$I,7,FALSE)))))))","v":"GEYSER T-shirt | essential"},{"$f":"IF(Master!C238<>\"\",Master!C238*Selection!$B$3,\"\")","v":40},{"$f":"IF(Master!D238<>\"\",Master!D238*Selection!$B$3,\"\")","v":""},"",{"$f":"IF(Master!F238<>\"\",Master!F238*Selection!$B$3,\"\")","v":""},{"$f":"IF(Factor!#REF!<>\"\",Factor!#REF!*Selection!$B$3,\"\")","v":{"$error":"#REF!"}}]
["G21048",{"$f":"IF(Selection!$B$4=\"DK\",VLOOKUP($A239,'Style navne sprog'!$A:$I,6,FALSE),IF(Selection!$B$4=\"DE\",VLOOKUP($A239,'Style navne sprog'!$A:$I,2,FALSE),IF(Selection!$B$4=\"GB\",VLOOKUP($A239,'Style navne sprog'!$A:$I,4,FALSE),IF(Selection!$B$4=\"SE\",VLOOKUP($A239,'Style navne sprog'!$A:$I,3,FALSE),IF(Selection!$B$4=\"NO\",VLOOKUP($A239,'Style navne sprog'!$A:$I,5,FALSE),IF(Selection!$B$4=\"PL\",VLOOKUP($A239,'Style navne sprog'!$A:$I,7,FALSE)))))))","v":"GEYSER performance tights | long"},{"$f":"IF(Master!C239<>\"\",Master!C239*Selection!$B$3,\"\")","v":81.100000000000009},{"$f":"IF(Master!D239<>\"\",Master!D239*Selection!$B$3,\"\")","v":""},"",{"$f":"IF(Master!F239<>\"\",Master!F239*Selection!$B$3,\"\")","v":""},{"$f":"IF(Factor!#REF!<>\"\",Factor!#REF!*Selection!$B$3,\"\")","v":{"$error":"#REF!"}}]
["G21049",{"$f":"IF(Selection!$B$4=\"DK\",VLOOKUP($A240,'Style navne sprog'!$A:$I,6,FALSE),IF(Selection!$B$4=\"DE\",VLOOKUP($A240,'Style navne sprog'!$A:$I,2,FALSE),IF(Selection!$B$4=\"GB\",VLOOKUP($A240,'Style navne sprog'!$A:$I,4,FALSE),IF(Selection!$B$4=\"SE\",VLOOKUP($A240,'Style navne sprog'!$A:$I,3,FALSE),IF(Selection!$B$4=\"NO\",VLOOKUP($A240,'Style navne sprog'!$A:$I,5,FALSE),IF(Selection!$B$4=\"PL\",VLOOKUP($A240,'Style navne sprog'!$A:$I,7,FALSE)))))))","v":"GEYSER performance tights | short"},{"$f":"IF(Master!C240<>\"\",Master!C240*Selection!$B$3,\"\")","v":62.300000000000004},{"$f":"IF(Master!D240<>\"\",Master!D240*Selection!$B$3,\"\")","v":""},"",{"$f":"IF(Master!F240<>\"\",Master!F240*Selection!$B$3,\"\")","v":""},{"$f":"IF(Factor!#REF!<>\"\",Factor!#REF!*Selection!$B$3,\"\")","v":{"$error":"#REF!"}}]
["G21070",{"$f":"IF(Selection!$B$4=\"DK\",VLOOKUP($A241,'Style navne sprog'!$A:$I,6,FALSE),IF(Selection!$B$4=\"DE\",VLOOKUP($A241,'Style navne sprog'!$A:$I,2,FALSE),IF(Selection!$B$4=\"GB\",VLOOKUP($A241,'Style navne sprog'!$A:$I,4,FALSE),IF(Selection!$B$4=\"SE\",VLOOKUP($A241,'Style navne sprog'!$A:$I,3,FALSE),IF(Selection!$B$4=\"NO\",VLOOKUP($A241,'Style navne sprog'!$A:$I,5,FALSE),IF(Selection!$B$4=\"PL\",VLOOKUP($A241,'Style navne sprog'!$A:$I,7,FALSE)))))))","v":"GEYSER winter jacket"},{"$f":"IF(Master!C241<>\"\",Master!C241*Selection!$B$3,\"\")","v":249.4},{"$f":"IF(Master!D241<>\"\",Master!D241*Selection!$B$3,\"\")","v":""},"",{"$f":"IF(Master!F241<>\"\",Master!F241*Selection!$B$3,\"\")","v":""},{"$f":"IF(Factor!#REF!<>\"\",Factor!#REF!*Selection!$B$3,\"\")","v":{"$error":"#REF!"}}]
["G21080",{"$f":"IF(Selection!$B$4=\"DK\",VLOOKUP($A242,'Style navne sprog'!$A:$I,6,FALSE),IF(Selection!$B$4=\"DE\",VLOOKUP($A242,'Style navne sprog'!$A:$I,2,FALSE),IF(Selection!$B$4=\"GB\",VLOOKUP($A242,'Style navne sprog'!$A:$I,4,FALSE),IF(Selection!$B$4=\"SE\",VLOOKUP($A242,'Style navne sprog'!$A:$I,3,FALSE),IF(Selection!$B$4=\"NO\",VLOOKUP($A242,'Style navne sprog'!$A:$I,5,FALSE),IF(Selection!$B$4=\"PL\",VLOOKUP($A242,'Style navne sprog'!$A:$I,7,FALSE)))))))","v":"GEYSER stretch hoodie"},{"$f":"IF(Master!C242<>\"\",Master!C242*Selection!$B$3,\"\")","v":134.1},{"$f":"IF(Master!D242<>\"\",Master!D242*Selection!$B$3,\"\")","v":""},"",{"$f":"IF(Master!F242<>\"\",Master!F242*Selection!$B$3,\"\")","v":""},{"$f":"IF(Factor!#REF!<>\"\",Factor!#REF!*Selection!$B$3,\"\")","v":{"$error":"#REF!"}}]
["G21090",{"$f":"IF(Selection!$B$4=\"DK\",VLOOKUP($A243,'Style navne sprog'!$A:$I,6,FALSE),IF(Selection!$B$4=\"DE\",VLOOKUP($A243,'Style navne sprog'!$A:$I,2,FALSE),IF(Selection!$B$4=\"GB\",VLOOKUP($A243,'Style navne sprog'!$A:$I,4,FALSE),IF(Selection!$B$4=\"SE\",VLOOKUP($A243,'Style navne sprog'!$A:$I,3,FALSE),IF(Selection!$B$4=\"NO\",VLOOKUP($A243,'Style navne sprog'!$A:$I,5,FALSE),IF(Selection!$B$4=\"PL\",VLOOKUP($A243,'Style navne sprog'!$A:$I,7,FALSE)))))))","v":"GEYSER stretch trainer | ¼ zip"},{"$f":"IF(Master!C243<>\"\",Master!C243*Selection!$B$3,\"\")","v":107.2},{"$f":"IF(Master!D243<>\"\",Master!D243*Selection!$B$3,\"\")","v":""},"",{"$f":"IF(Master!F243<>\"\",Master!F243*Selection!$B$3,\"\")","v":""},{"$f":"IF(Factor!#REF!<>\"\",Factor!#REF!*Selection!$B$3,\"\")","v":{"$error":"#REF!"}}]
["G50000",{"$f":"IF(Selection!$B$4=\"DK\",VLOOKUP($A244,'Style navne sprog'!$A:$I,6,FALSE),IF(Selection!$B$4=\"DE\",VLOOKUP($A244,'Style navne sprog'!$A:$I,2,FALSE),IF(Selection!$B$4=\"GB\",VLOOKUP($A244,'Style navne sprog'!$A:$I,4,FALSE),IF(Selection!$B$4=\"SE\",VLOOKUP($A244,'Style navne sprog'!$A:$I,3,FALSE),IF(Selection!$B$4=\"NO\",VLOOKUP($A244,'Style navne sprog'!$A:$I,5,FALSE),IF(Selection!$B$4=\"PL\",VLOOKUP($A244,'Style navne sprog'!$A:$I,7,FALSE)))))))","v":"GEYSER stretch running socks"},{"$f":"IF(Master!C244<>\"\",Master!C244*Selection!$B$3,\"\")","v":21.200000000000003},{"$f":"IF(Master!D244<>\"\",Master!D244*Selection!$B$3,\"\")","v":""},"",{"$f":"IF(Master!F244<>\"\",Master!F244*Selection!$B$3,\"\")","v":""},{"$f":"IF(Factor!#REF!<>\"\",Factor!#REF!*Selection!$B$3,\"\")","v":{"$error":"#REF!"}}]
["G60010",{"$f":"IF(Selection!$B$4=\"DK\",VLOOKUP($A245,'Style navne sprog'!$A:$I,6,FALSE),IF(Selection!$B$4=\"DE\",VLOOKUP($A245,'Style navne sprog'!$A:$I,2,FALSE),IF(Selection!$B$4=\"GB\",VLOOKUP($A245,'Style navne sprog'!$A:$I,4,FALSE),IF(Selection!$B$4=\"SE\",VLOOKUP($A245,'Style navne sprog'!$A:$I,3,FALSE),IF(Selection!$B$4=\"NO\",VLOOKUP($A245,'Style navne sprog'!$A:$I,5,FALSE),IF(Selection!$B$4=\"PL\",VLOOKUP($A245,'Style navne sprog'!$A:$I,7,FALSE)))))))","v":"GEYSER backpack"},{"$f":"IF(Master!C245<>\"\",Master!C245*Selection!$B$3,\"\")","v":107.2},{"$f":"IF(Master!D245<>\"\",Master!D245*Selection!$B$3,\"\")","v":""},"",{"$f":"IF(Master!F245<>\"\",Master!F245*Selection!$B$3,\"\")","v":""},{"$f":"IF(Factor!#REF!<>\"\",Factor!#REF!*Selection!$B$3,\"\")","v":{"$error":"#REF!"}}]
[]
["SEVEN SEAS - T-SHIRTS"]
["S620",{"$f":"IF(Selection!$B$4=\"DK\",VLOOKUP($A248,'Style navne sprog'!$A:$I,6,FALSE),IF(Selection!$B$4=\"DE\",VLOOKUP($A248,'Style navne sprog'!$A:$I,2,FALSE),IF(Selection!$B$4=\"GB\",VLOOKUP($A248,'Style navne sprog'!$A:$I,4,FALSE),IF(Selection!$B$4=\"SE\",VLOOKUP($A248,'Style navne sprog'!$A:$I,3,FALSE),IF(Selection!$B$4=\"NO\",VLOOKUP($A248,'Style navne sprog'!$A:$I,5,FALSE),IF(Selection!$B$4=\"PL\",VLOOKUP($A248,'Style navne sprog'!$A:$I,7,FALSE)))))))","v":"SEVEN SEAS T-shirt | o-neck"},{"$f":"IF(Master!C248<>\"\",Master!C248*Selection!$B$3,\"\")","v":33.700000000000003},{"$f":"IF(Master!D248<>\"\",Master!D248*Selection!$B$3,\"\")","v":""},"3XL",{"$f":"IF(Master!F248<>\"\",Master!F248*Selection!$B$3,\"\")","v":2.8000000000000003},{"$f":"IF(Factor!#REF!<>\"\",Factor!#REF!*Selection!$B$3,\"\")","v":{"$error":"#REF!"}}]
["S630",{"$f":"IF(Selection!$B$4=\"DK\",VLOOKUP($A249,'Style navne sprog'!$A:$I,6,FALSE),IF(Selection!$B$4=\"DE\",VLOOKUP($A249,'Style navne sprog'!$A:$I,2,FALSE),IF(Selection!$B$4=\"GB\",VLOOKUP($A249,'Style navne sprog'!$A:$I,4,FALSE),IF(Selection!$B$4=\"SE\",VLOOKUP($A249,'Style navne sprog'!$A:$I,3,FALSE),IF(Selection!$B$4=\"NO\",VLOOKUP($A249,'Style navne sprog'!$A:$I,5,FALSE),IF(Selection!$B$4=\"PL\",VLOOKUP($A249,'Style navne sprog'!$A:$I,7,FALSE)))))))","v":"SEVEN SEAS T-shirt | o-neck | women"},{"$f":"IF(Master!C249<>\"\",Master!C249*Selection!$B$3,\"\")","v":33.700000000000003},{"$f":"IF(Master!D249<>\"\",Master!D249*Selection!$B$3,\"\")","v":""},"3XL",{"$f":"IF(Master!F249<>\"\",Master!F249*Selection!$B$3,\"\")","v":2.8000000000000003},{"$f":"IF(Factor!#REF!<>\"\",Factor!#REF!*Selection!$B$3,\"\")","v":{"$error":"#REF!"}}]
[]
["SEVEN SEAS - POLOSHIRTS"]
["S600",{"$f":"IF(Selection!$B$4=\"DK\",VLOOKUP($A252,'Style navne sprog'!$A:$I,6,FALSE),IF(Selection!$B$4=\"DE\",VLOOKUP($A252,'Style navne sprog'!$A:$I,2,FALSE),IF(Selection!$B$4=\"GB\",VLOOKUP($A252,'Style navne sprog'!$A:$I,4,FALSE),IF(Selection!$B$4=\"SE\",VLOOKUP($A252,'Style navne sprog'!$A:$I,3,FALSE),IF(Selection!$B$4=\"NO\",VLOOKUP($A252,'Style navne sprog'!$A:$I,5,FALSE),IF(Selection!$B$4=\"PL\",VLOOKUP($A252,'Style navne sprog'!$A:$I,7,FALSE)))))))","v":"SEVEN SEAS The polo"},{"$f":"IF(Master!C252<>\"\",Master!C252*Selection!$B$3,\"\")","v":68.2},{"$f":"IF(Master!D252<>\"\",Master!D252*Selection!$B$3,\"\")","v":""},"3XL",{"$f":"IF(Master!F252<>\"\",Master!F252*Selection!$B$3,\"\")","v":5.4},{"$f":"IF(Factor!#REF!<>\"\",Factor!#REF!*Selection!$B$3,\"\")","v":{"$error":"#REF!"}}]
["S610",{"$f":"IF(Selection!$B$4=\"DK\",VLOOKUP($A253,'Style navne sprog'!$A:$I,6,FALSE),IF(Selection!$B$4=\"DE\",VLOOKUP($A253,'Style navne sprog'!$A:$I,2,FALSE),IF(Selection!$B$4=\"GB\",VLOOKUP($A253,'Style navne sprog'!$A:$I,4,FALSE),IF(Selection!$B$4=\"SE\",VLOOKUP($A253,'Style navne sprog'!$A:$I,3,FALSE),IF(Selection!$B$4=\"NO\",VLOOKUP($A253,'Style navne sprog'!$A:$I,5,FALSE),IF(Selection!$B$4=\"PL\",VLOOKUP($A253,'Style navne sprog'!$A:$I,7,FALSE)))))))","v":"SEVEN SEAS The polo | women"},{"$f":"IF(Master!C253<>\"\",Master!C253*Selection!$B$3,\"\")","v":68.2},{"$f":"IF(Master!D253<>\"\",Master!D253*Selection!$B$3,\"\")","v":""},"3XL",{"$f":"IF(Master!F253<>\"\",Master!F253*Selection!$B$3,\"\")","v":5.4},{"$f":"IF(Factor!#REF!<>\"\",Factor!#REF!*Selection!$B$3,\"\")","v":{"$error":"#REF!"}}]
[]
["SEVEN SEAS - KNIT"]
["S640",{"$f":"IF(Selection!$B$4=\"DK\",VLOOKUP($A256,'Style navne sprog'!$A:$I,6,FALSE),IF(Selection!$B$4=\"DE\",VLOOKUP($A256,'Style navne sprog'!$A:$I,2,FALSE),IF(Selection!$B$4=\"GB\",VLOOKUP($A256,'Style navne sprog'!$A:$I,4,FALSE),IF(Selection!$B$4=\"SE\",VLOOKUP($A256,'Style navne sprog'!$A:$I,3,FALSE),IF(Selection!$B$4=\"NO\",VLOOKUP($A256,'Style navne sprog'!$A:$I,5,FALSE),IF(Selection!$B$4=\"PL\",VLOOKUP($A256,'Style navne sprog'!$A:$I,7,FALSE)))))))","v":"SEVEN SEAS The knit | o-neck | women"},{"$f":"IF(Master!C256<>\"\",Master!C256*Selection!$B$3,\"\")","v":107.10000000000001},{"$f":"IF(Master!D256<>\"\",Master!D256*Selection!$B$3,\"\")","v":""},"3XL",{"$f":"IF(Master!F256<>\"\",Master!F256*Selection!$B$3,\"\")","v":5.4},{"$f":"IF(Factor!#REF!<>\"\",Factor!#REF!*Selection!$B$3,\"\")","v":{"$error":"#REF!"}}]
["S650",{"$f":"IF(Selection!$B$4=\"DK\",VLOOKUP($A257,'Style navne sprog'!$A:$I,6,FALSE),IF(Selection!$B$4=\"DE\",VLOOKUP($A257,'Style navne sprog'!$A:$I,2,FALSE),IF(Selection!$B$4=\"GB\",VLOOKUP($A257,'Style navne sprog'!$A:$I,4,FALSE),IF(Selection!$B$4=\"SE\",VLOOKUP($A257,'Style navne sprog'!$A:$I,3,FALSE),IF(Selection!$B$4=\"NO\",VLOOKUP($A257,'Style navne sprog'!$A:$I,5,FALSE),IF(Selection!$B$4=\"PL\",VLOOKUP($A257,'Style navne sprog'!$A:$I,7,FALSE)))))))","v":"SEVEN SEAS The knit | o-neck"},{"$f":"IF(Master!C257<>\"\",Master!C257*Selection!$B$3,\"\")","v":107.10000000000001},{"$f":"IF(Master!D257<>\"\",Master!D257*Selection!$B$3,\"\")","v":""},"3XL",{"$f":"IF(Master!F257<>\"\",Master!F257*Selection!$B$3,\"\")","v":5.4},{"$f":"IF(Factor!#REF!<>\"\",Factor!#REF!*Selection!$B$3,\"\")","v":{"$error":"#REF!"}}]
["S660",{"$f":"IF(Selection!$B$4=\"DK\",VLOOKUP($A258,'Style navne sprog'!$A:$I,6,FALSE),IF(Selection!$B$4=\"DE\",VLOOKUP($A258,'Style navne sprog'!$A:$I,2,FALSE),IF(Selection!$B$4=\"GB\",VLOOKUP($A258,'Style navne sprog'!$A:$I,4,FALSE),IF(Selection!$B$4=\"SE\",VLOOKUP($A258,'Style navne sprog'!$A:$I,3,FALSE),IF(Selection!$B$4=\"NO\",VLOOKUP($A258,'Style navne sprog'!$A:$I,5,FALSE),IF(Selection!$B$4=\"PL\",VLOOKUP($A258,'Style navne sprog'!$A:$I,7,FALSE)))))))","v":"SEVEN SEAS The cardigan"},{"$f":"IF(Master!C258<>\"\",Master!C258*Selection!$B$3,\"\")","v":135.70000000000002},{"$f":"IF(Master!D258<>\"\",Master!D258*Selection!$B$3,\"\")","v":""},"3XL",{"$f":"IF(Master!F258<>\"\",Master!F258*Selection!$B$3,\"\")","v":5.4},{"$f":"IF(Factor!#REF!<>\"\",Factor!#REF!*Selection!$B$3,\"\")","v":{"$error":"#REF!"}}]
["S661",{"$f":"IF(Selection!$B$4=\"DK\",VLOOKUP($A259,'Style navne sprog'!$A:$I,6,FALSE),IF(Selection!$B$4=\"DE\",VLOOKUP($A259,'Style navne sprog'!$A:$I,2,FALSE),IF(Selection!$B$4=\"GB\",VLOOKUP($A259,'Style navne sprog'!$A:$I,4,FALSE),IF(Selection!$B$4=\"SE\",VLOOKUP($A259,'Style navne sprog'!$A:$I,3,FALSE),IF(Selection!$B$4=\"NO\",VLOOKUP($A259,'Style navne sprog'!$A:$I,5,FALSE),IF(Selection!$B$4=\"PL\",VLOOKUP($A259,'Style navne sprog'!$A:$I,7,FALSE)))))))","v":"SEVEN SEAS The cardigan | women"},{"$f":"IF(Master!C259<>\"\",Master!C259*Selection!$B$3,\"\")","v":135.70000000000002},{"$f":"IF(Master!D259<>\"\",Master!D259*Selection!$B$3,\"\")","v":""},"3XL",{"$f":"IF(Master!F259<>\"\",Master!F259*Selection!$B$3,\"\")","v":5.4},{"$f":"IF(Factor!#REF!<>\"\",Factor!#REF!*Selection!$B$3,\"\")","v":{"$error":"#REF!"}}]
["S670",{"$f":"IF(Selection!$B$4=\"DK\",VLOOKUP($A260,'Style navne sprog'!$A:$I,6,FALSE),IF(Selection!$B$4=\"DE\",VLOOKUP($A260,'Style navne sprog'!$A:$I,2,FALSE),IF(Selection!$B$4=\"GB\",VLOOKUP($A260,'Style navne sprog'!$A:$I,4,FALSE),IF(Selection!$B$4=\"SE\",VLOOKUP($A260,'Style navne sprog'!$A:$I,3,FALSE),IF(Selection!$B$4=\"NO\",VLOOKUP($A260,'Style navne sprog'!$A:$I,5,FALSE),IF(Selection!$B$4=\"PL\",VLOOKUP($A260,'Style navne sprog'!$A:$I,7,FALSE)))))))","v":"SEVEN SEAS The knit | v-neck"},{"$f":"IF(Master!C260<>\"\",Master!C260*Selection!$B$3,\"\")","v":107.10000000000001},{"$f":"IF(Master!D260<>\"\",Master!D260*Selection!$B$3,\"\")","v":""},"3XL",{"$f":"IF(Master!F260<>\"\",Master!F260*Selection!$B$3,\"\")","v":5.4},{"$f":"IF(Factor!#REF!<>\"\",Factor!#REF!*Selection!$B$3,\"\")","v":{"$error":"#REF!"}}]
["S671",{"$f":"IF(Selection!$B$4=\"DK\",VLOOKUP($A261,'Style navne sprog'!$A:$I,6,FALSE),IF(Selection!$B$4=\"DE\",VLOOKUP($A261,'Style navne sprog'!$A:$I,2,FALSE),IF(Selection!$B$4=\"GB\",VLOOKUP($A261,'Style navne sprog'!$A:$I,4,FALSE),IF(Selection!$B$4=\"SE\",VLOOKUP($A261,'Style navne sprog'!$A:$I,3,FALSE),IF(Selection!$B$4=\"NO\",VLOOKUP($A261,'Style navne sprog'!$A:$I,5,FALSE),IF(Selection!$B$4=\"PL\",VLOOKUP($A261,'Style navne sprog'!$A:$I,7,FALSE)))))))","v":"SEVEN SEAS The knit | v-neck | women"},{"$f":"IF(Master!C261<>\"\",Master!C261*Selection!$B$3,\"\")","v":107.10000000000001},{"$f":"IF(Master!D261<>\"\",Master!D261*Selection!$B$3,\"\")","v":""},"3XL",{"$f":"IF(Master!F261<>\"\",Master!F261*Selection!$B$3,\"\")","v":5.4},{"$f":"IF(Factor!#REF!<>\"\",Factor!#REF!*Selection!$B$3,\"\")","v":{"$error":"#REF!"}}]
[]
["SEVEN SEAS - SHIRTS"]
["S370",{"$f":"IF(Selection!$B$4=\"DK\",VLOOKUP($A264,'Style navne sprog'!$A:$I,6,FALSE),IF(Selection!$B$4=\"DE\",VLOOKUP($A264,'Style navne sprog'!$A:$I,2,FALSE),IF(Selection!$B$4=\"GB\",VLOOKUP($A264,'Style navne sprog'!$A:$I,4,FALSE),IF(Selection!$B$4=\"SE\",VLOOKUP($A264,'Style navne sprog'!$A:$I,3,FALSE),IF(Selection!$B$4=\"NO\",VLOOKUP($A264,'Style navne sprog'!$A:$I,5,FALSE),IF(Selection!$B$4=\"PL\",VLOOKUP($A264,'Style navne sprog'!$A:$I,7,FALSE)))))))","v":"SEVEN SEAS Fine Twill Contrast | modern"},{"$f":"IF(Master!C264<>\"\",Master!C264*Selection!$B$3,\"\")","v":107.10000000000001},{"$f":"IF(Master!D264<>\"\",Master!D264*Selection!$B$3,\"\")","v":""},"3XL-5XL",{"$f":"IF(Master!F264<>\"\",Master!F264*Selection!$B$3,\"\")","v":5.4},{"$f":"IF(Factor!#REF!<>\"\",Factor!#REF!*Selection!$B$3,\"\")","v":{"$error":"#REF!"}}]
["S371",{"$f":"IF(Selection!$B$4=\"DK\",VLOOKUP($A265,'Style navne sprog'!$A:$I,6,FALSE),IF(Selection!$B$4=\"DE\",VLOOKUP($A265,'Style navne sprog'!$A:$I,2,FALSE),IF(Selection!$B$4=\"GB\",VLOOKUP($A265,'Style navne sprog'!$A:$I,4,FALSE),IF(Selection!$B$4=\"SE\",VLOOKUP($A265,'Style navne sprog'!$A:$I,3,FALSE),IF(Selection!$B$4=\"NO\",VLOOKUP($A265,'Style navne sprog'!$A:$I,5,FALSE),IF(Selection!$B$4=\"PL\",VLOOKUP($A265,'Style navne sprog'!$A:$I,7,FALSE)))))))","v":"SEVEN SEAS Fine Twill Contrast | slim"},{"$f":"IF(Master!C265<>\"\",Master!C265*Selection!$B$3,\"\")","v":107.10000000000001},{"$f":"IF(Master!D265<>\"\",Master!D265*Selection!$B$3,\"\")","v":""},"3XL-4XL",{"$f":"IF(Master!F265<>\"\",Master!F265*Selection!$B$3,\"\")","v":""},{"$f":"IF(Factor!#REF!<>\"\",Factor!#REF!*Selection!$B$3,\"\")","v":{"$error":"#REF!"}}]
["S372",{"$f":"IF(Selection!$B$4=\"DK\",VLOOKUP($A266,'Style navne sprog'!$A:$I,6,FALSE),IF(Selection!$B$4=\"DE\",VLOOKUP($A266,'Style navne sprog'!$A:$I,2,FALSE),IF(Selection!$B$4=\"GB\",VLOOKUP($A266,'Style navne sprog'!$A:$I,4,FALSE),IF(Selection!$B$4=\"SE\",VLOOKUP($A266,'Style navne sprog'!$A:$I,3,FALSE),IF(Selection!$B$4=\"NO\",VLOOKUP($A266,'Style navne sprog'!$A:$I,5,FALSE),IF(Selection!$B$4=\"PL\",VLOOKUP($A266,'Style navne sprog'!$A:$I,7,FALSE)))))))","v":"SEVEN SEAS Fine Twill Contrast | modern | women"},{"$f":"IF(Master!C266<>\"\",Master!C266*Selection!$B$3,\"\")","v":107.10000000000001},{"$f":"IF(Master!D266<>\"\",Master!D266*Selection!$B$3,\"\")","v":""},"3XL-4XL",{"$f":"IF(Master!F266<>\"\",Master!F266*Selection!$B$3,\"\")","v":5.4},{"$f":"IF(Factor!#REF!<>\"\",Factor!#REF!*Selection!$B$3,\"\")","v":{"$error":"#REF!"}}]
["S50",{"$f":"IF(Selection!$B$4=\"DK\",VLOOKUP($A267,'Style navne sprog'!$A:$I,6,FALSE),IF(Selection!$B$4=\"DE\",VLOOKUP($A267,'Style navne sprog'!$A:$I,2,FALSE),IF(Selection!$B$4=\"GB\",VLOOKUP($A267,'Style navne sprog'!$A:$I,4,FALSE),IF(Selection!$B$4=\"SE\",VLOOKUP($A267,'Style navne sprog'!$A:$I,3,FALSE),IF(Selection!$B$4=\"NO\",VLOOKUP($A267,'Style navne sprog'!$A:$I,5,FALSE),IF(Selection!$B$4=\"PL\",VLOOKUP($A267,'Style navne sprog'!$A:$I,7,FALSE)))))))","v":"SEVEN SEAS Hybrid shirt | modern"},{"$f":"IF(Master!C267<>\"\",Master!C267*Selection!$B$3,\"\")","v":134},{"$f":"IF(Master!D267<>\"\",Master!D267*Selection!$B$3,\"\")","v":""},"3XL-4XL",{"$f":"IF(Master!F267<>\"\",Master!F267*Selection!$B$3,\"\")","v":5.4},{"$f":"IF(Factor!#REF!<>\"\",Factor!#REF!*Selection!$B$3,\"\")","v":{"$error":"#REF!"}}]
["S51",{"$f":"IF(Selection!$B$4=\"DK\",VLOOKUP($A268,'Style navne sprog'!$A:$I,6,FALSE),IF(Selection!$B$4=\"DE\",VLOOKUP($A268,'Style navne sprog'!$A:$I,2,FALSE),IF(Selection!$B$4=\"GB\",VLOOKUP($A268,'Style navne sprog'!$A:$I,4,FALSE),IF(Selection!$B$4=\"SE\",VLOOKUP($A268,'Style navne sprog'!$A:$I,3,FALSE),IF(Selection!$B$4=\"NO\",VLOOKUP($A268,'Style navne sprog'!$A:$I,5,FALSE),IF(Selection!$B$4=\"PL\",VLOOKUP($A268,'Style navne sprog'!$A:$I,7,FALSE)))))))","v":"SEVEN SEAS Hybrid shirt | slim"},{"$f":"IF(Master!C268<>\"\",Master!C268*Selection!$B$3,\"\")","v":134},{"$f":"IF(Master!D268<>\"\",Master!D268*Selection!$B$3,\"\")","v":""},"",{"$f":"IF(Master!F268<>\"\",Master!F268*Selection!$B$3,\"\")","v":""},{"$f":"IF(Factor!#REF!<>\"\",Factor!#REF!*Selection!$B$3,\"\")","v":{"$error":"#REF!"}}]
["S52",{"$f":"IF(Selection!$B$4=\"DK\",VLOOKUP($A269,'Style navne sprog'!$A:$I,6,FALSE),IF(Selection!$B$4=\"DE\",VLOOKUP($A269,'Style navne sprog'!$A:$I,2,FALSE),IF(Selection!$B$4=\"GB\",VLOOKUP($A269,'Style navne sprog'!$A:$I,4,FALSE),IF(Selection!$B$4=\"SE\",VLOOKUP($A269,'Style navne sprog'!$A:$I,3,FALSE),IF(Selection!$B$4=\"NO\",VLOOKUP($A269,'Style navne sprog'!$A:$I,5,FALSE),IF(Selection!$B$4=\"PL\",VLOOKUP($A269,'Style navne sprog'!$A:$I,7,FALSE)))))))","v":"SEVEN SEAS Hybrid shirt | modern | women"},{"$f":"IF(Master!C269<>\"\",Master!C269*Selection!$B$3,\"\")","v":134},{"$f":"IF(Master!D269<>\"\",Master!D269*Selection!$B$3,\"\")","v":""},"3XL-4XL",{"$f":"IF(Master!F269<>\"\",Master!F269*Selection!$B$3,\"\")","v":5.4},{"$f":"IF(Factor!#REF!<>\"\",Factor!#REF!*Selection!$B$3,\"\")","v":{"$error":"#REF!"}}]
["S60",{"$f":"IF(Selection!$B$4=\"DK\",VLOOKUP($A270,'Style navne sprog'!$A:$I,6,FALSE),IF(Selection!$B$4=\"DE\",VLOOKUP($A270,'Style navne sprog'!$A:$I,2,FALSE),IF(Selection!$B$4=\"GB\",VLOOKUP($A270,'Style navne sprog'!$A:$I,4,FALSE),IF(Selection!$B$4=\"SE\",VLOOKUP($A270,'Style navne sprog'!$A:$I,3,FALSE),IF(Selection!$B$4=\"NO\",VLOOKUP($A270,'Style navne sprog'!$A:$I,5,FALSE),IF(Selection!$B$4=\"PL\",VLOOKUP($A270,'Style navne sprog'!$A:$I,7,FALSE)))))))","v":"SEVEN SEAS Oxford | modern"},{"$f":"IF(Master!C270<>\"\",Master!C270*Selection!$B$3,\"\")","v":107.10000000000001},{"$f":"IF(Master!D270<>\"\",Master!D270*Selection!$B$3,\"\")","v":""},"3XL-5XL",{"$f":"IF(Master!F270<>\"\",Master!F270*Selection!$B$3,\"\")","v":5.4},{"$f":"IF(Factor!#REF!<>\"\",Factor!#REF!*Selection!$B$3,\"\")","v":{"$error":"#REF!"}}]
["S61",{"$f":"IF(Selection!$B$4=\"DK\",VLOOKUP($A271,'Style navne sprog'!$A:$I,6,FALSE),IF(Selection!$B$4=\"DE\",VLOOKUP($A271,'Style navne sprog'!$A:$I,2,FALSE),IF(Selection!$B$4=\"GB\",VLOOKUP($A271,'Style navne sprog'!$A:$I,4,FALSE),IF(Selection!$B$4=\"SE\",VLOOKUP($A271,'Style navne sprog'!$A:$I,3,FALSE),IF(Selection!$B$4=\"NO\",VLOOKUP($A271,'Style navne sprog'!$A:$I,5,FALSE),IF(Selection!$B$4=\"PL\",VLOOKUP($A271,'Style navne sprog'!$A:$I,7,FALSE)))))))","v":"SEVEN SEAS Oxford | slim"},{"$f":"IF(Master!C271<>\"\",Master!C271*Selection!$B$3,\"\")","v":107.10000000000001},{"$f":"IF(Master!D271<>\"\",Master!D271*Selection!$B$3,\"\")","v":""},"3XL",{"$f":"IF(Master!F271<>\"\",Master!F271*Selection!$B$3,\"\")","v":5.4},{"$f":"IF(Factor!#REF!<>\"\",Factor!#REF!*Selection!$B$3,\"\")","v":{"$error":"#REF!"}}]
["S62",{"$f":"IF(Selection!$B$4=\"DK\",VLOOKUP($A272,'Style navne sprog'!$A:$I,6,FALSE),IF(Selection!$B$4=\"DE\",VLOOKUP($A272,'Style navne sprog'!$A:$I,2,FALSE),IF(Selection!$B$4=\"GB\",VLOOKUP($A272,'Style navne sprog'!$A:$I,4,FALSE),IF(Selection!$B$4=\"SE\",VLOOKUP($A272,'Style navne sprog'!$A:$I,3,FALSE),IF(Selection!$B$4=\"NO\",VLOOKUP($A272,'Style navne sprog'!$A:$I,5,FALSE),IF(Selection!$B$4=\"PL\",VLOOKUP($A272,'Style navne sprog'!$A:$I,7,FALSE)))))))","v":"SEVEN SEAS Oxford | modern | women"},{"$f":"IF(Master!C272<>\"\",Master!C272*Selection!$B$3,\"\")","v":107.10000000000001},{"$f":"IF(Master!D272<>\"\",Master!D272*Selection!$B$3,\"\")","v":""},"3XL-4XL",{"$f":"IF(Master!F272<>\"\",Master!F272*Selection!$B$3,\"\")","v":5.4},{"$f":"IF(Factor!#REF!<>\"\",Factor!#REF!*Selection!$B$3,\"\")","v":{"$error":"#REF!"}}]
["S63",{"$f":"IF(Selection!$B$4=\"DK\",VLOOKUP($A273,'Style navne sprog'!$A:$I,6,FALSE),IF(Selection!$B$4=\"DE\",VLOOKUP($A273,'Style navne sprog'!$A:$I,2,FALSE),IF(Selection!$B$4=\"GB\",VLOOKUP($A273,'Style navne sprog'!$A:$I,4,FALSE),IF(Selection!$B$4=\"SE\",VLOOKUP($A273,'Style navne sprog'!$A:$I,3,FALSE),IF(Selection!$B$4=\"NO\",VLOOKUP($A273,'Style navne sprog'!$A:$I,5,FALSE),IF(Selection!$B$4=\"PL\",VLOOKUP($A273,'Style navne sprog'!$A:$I,7,FALSE)))))))","v":"SEVEN SEAS Oxford | long | modern | women"},{"$f":"IF(Master!C273<>\"\",Master!C273*Selection!$B$3,\"\")","v":107.10000000000001},{"$f":"IF(Master!D273<>\"\",Master!D273*Selection!$B$3,\"\")","v":""},"3XL-4XL",{"$f":"IF(Master!F273<>\"\",Master!F273*Selection!$B$3,\"\")","v":5.4},{"$f":"IF(Factor!#REF!<>\"\",Factor!#REF!*Selection!$B$3,\"\")","v":{"$error":"#REF!"}}]
["S70",{"$f":"IF(Selection!$B$4=\"DK\",VLOOKUP($A274,'Style navne sprog'!$A:$I,6,FALSE),IF(Selection!$B$4=\"DE\",VLOOKUP($A274,'Style navne sprog'!$A:$I,2,FALSE),IF(Selection!$B$4=\"GB\",VLOOKUP($A274,'Style navne sprog'!$A:$I,4,FALSE),IF(Selection!$B$4=\"SE\",VLOOKUP($A274,'Style navne sprog'!$A:$I,3,FALSE),IF(Selection!$B$4=\"NO\",VLOOKUP($A274,'Style navne sprog'!$A:$I,5,FALSE),IF(Selection!$B$4=\"PL\",VLOOKUP($A274,'Style navne sprog'!$A:$I,7,FALSE)))))))","v":"SEVEN SEAS Fine Twill Cadet | modern"},{"$f":"IF(Master!C274<>\"\",Master!C274*Selection!$B$3,\"\")","v":107.10000000000001},{"$f":"IF(Master!D274<>\"\",Master!D274*Selection!$B$3,\"\")","v":""},"3XL-5XL",{"$f":"IF(Master!F274<>\"\",Master!F274*Selection!$B$3,\"\")","v":5.4},{"$f":"IF(Factor!#REF!<>\"\",Factor!#REF!*Selection!$B$3,\"\")","v":{"$error":"#REF!"}}]
["S721",{"$f":"IF(Selection!$B$4=\"DK\",VLOOKUP($A275,'Style navne sprog'!$A:$I,6,FALSE),IF(Selection!$B$4=\"DE\",VLOOKUP($A275,'Style navne sprog'!$A:$I,2,FALSE),IF(Selection!$B$4=\"GB\",VLOOKUP($A275,'Style navne sprog'!$A:$I,4,FALSE),IF(Selection!$B$4=\"SE\",VLOOKUP($A275,'Style navne sprog'!$A:$I,3,FALSE),IF(Selection!$B$4=\"NO\",VLOOKUP($A275,'Style navne sprog'!$A:$I,5,FALSE),IF(Selection!$B$4=\"PL\",VLOOKUP($A275,'Style navne sprog'!$A:$I,7,FALSE)))))))","v":"SEVEN SEAS Fine Twill | modern | s/s | women"},{"$f":"IF(Master!C275<>\"\",Master!C275*Selection!$B$3,\"\")","v":107.10000000000001},{"$f":"IF(Master!D275<>\"\",Master!D275*Selection!$B$3,\"\")","v":""},"3XL-4XL",{"$f":"IF(Master!F275<>\"\",Master!F275*Selection!$B$3,\"\")","v":5.4},{"$f":"IF(Factor!#REF!<>\"\",Factor!#REF!*Selection!$B$3,\"\")","v":{"$error":"#REF!"}}]
["S780",{"$f":"IF(Selection!$B$4=\"DK\",VLOOKUP($A276,'Style navne sprog'!$A:$I,6,FALSE),IF(Selection!$B$4=\"DE\",VLOOKUP($A276,'Style navne sprog'!$A:$I,2,FALSE),IF(Selection!$B$4=\"GB\",VLOOKUP($A276,'Style navne sprog'!$A:$I,4,FALSE),IF(Selection!$B$4=\"SE\",VLOOKUP($A276,'Style navne sprog'!$A:$I,3,FALSE),IF(Selection!$B$4=\"NO\",VLOOKUP($A276,'Style navne sprog'!$A:$I,5,FALSE),IF(Selection!$B$4=\"PL\",VLOOKUP($A276,'Style navne sprog'!$A:$I,7,FALSE)))))))","v":"SEVEN SEAS Fine Twill Cadet | modern | women"},{"$f":"IF(Master!C276<>\"\",Master!C276*Selection!$B$3,\"\")","v":107.10000000000001},{"$f":"IF(Master!D276<>\"\",Master!D276*Selection!$B$3,\"\")","v":""},"3XL-4XL",{"$f":"IF(Master!F276<>\"\",Master!F276*Selection!$B$3,\"\")","v":5.4},{"$f":"IF(Factor!#REF!<>\"\",Factor!#REF!*Selection!$B$3,\"\")","v":{"$error":"#REF!"}}]
["S84",{"$f":"IF(Selection!$B$4=\"DK\",VLOOKUP($A277,'Style navne sprog'!$A:$I,6,FALSE),IF(Selection!$B$4=\"DE\",VLOOKUP($A277,'Style navne sprog'!$A:$I,2,FALSE),IF(Selection!$B$4=\"GB\",VLOOKUP($A277,'Style navne sprog'!$A:$I,4,FALSE),IF(Selection!$B$4=\"SE\",VLOOKUP($A277,'Style navne sprog'!$A:$I,3,FALSE),IF(Selection!$B$4=\"NO\",VLOOKUP($A277,'Style navne sprog'!$A:$I,5,FALSE),IF(Selection!$B$4=\"PL\",VLOOKUP($A277,'Style navne sprog'!$A:$I,7,FALSE)))))))","v":"SEVEN SEAS The Jersey | modern"},{"$f":"IF(Master!C277<>\"\",Master!C277*Selection!$B$3,\"\")","v":107.10000000000001},{"$f":"IF(Master!D277<>\"\",Master!D277*Selection!$B$3,\"\")","v":""},"3XL-4XL",{"$f":"IF(Master!F277<>\"\",Master!F277*Selection!$B$3,\"\")","v":5.4},{"$f":"IF(Factor!#REF!<>\"\",Factor!#REF!*Selection!$B$3,\"\")","v":{"$error":"#REF!"}}]
["S85",{"$f":"IF(Selection!$B$4=\"DK\",VLOOKUP($A278,'Style navne sprog'!$A:$I,6,FALSE),IF(Selection!$B$4=\"DE\",VLOOKUP($A278,'Style navne sprog'!$A:$I,2,FALSE),IF(Selection!$B$4=\"GB\",VLOOKUP($A278,'Style navne sprog'!$A:$I,4,FALSE),IF(Selection!$B$4=\"SE\",VLOOKUP($A278,'Style navne sprog'!$A:$I,3,FALSE),IF(Selection!$B$4=\"NO\",VLOOKUP($A278,'Style navne sprog'!$A:$I,5,FALSE),IF(Selection!$B$4=\"PL\",VLOOKUP($A278,'Style navne sprog'!$A:$I,7,FALSE)))))))","v":"SEVEN SEAS The Jersey | modern | women"},{"$f":"IF(Master!C278<>\"\",Master!C278*Selection!$B$3,\"\")","v":107.10000000000001},{"$f":"IF(Master!D278<>\"\",Master!D278*Selection!$B$3,\"\")","v":""},"3XL-4XL",{"$f":"IF(Master!F278<>\"\",Master!F278*Selection!$B$3,\"\")","v":5.4},{"$f":"IF(Factor!#REF!<>\"\",Factor!#REF!*Selection!$B$3,\"\")","v":{"$error":"#REF!"}}]
["S86",{"$f":"IF(Selection!$B$4=\"DK\",VLOOKUP($A279,'Style navne sprog'!$A:$I,6,FALSE),IF(Selection!$B$4=\"DE\",VLOOKUP($A279,'Style navne sprog'!$A:$I,2,FALSE),IF(Selection!$B$4=\"GB\",VLOOKUP($A279,'Style navne sprog'!$A:$I,4,FALSE),IF(Selection!$B$4=\"SE\",VLOOKUP($A279,'Style navne sprog'!$A:$I,3,FALSE),IF(Selection!$B$4=\"NO\",VLOOKUP($A279,'Style navne sprog'!$A:$I,5,FALSE),IF(Selection!$B$4=\"PL\",VLOOKUP($A279,'Style navne sprog'!$A:$I,7,FALSE)))))))","v":"SEVEN SEAS The Jersey | slim"},{"$f":"IF(Master!C279<>\"\",Master!C279*Selection!$B$3,\"\")","v":107.10000000000001},{"$f":"IF(Master!D279<>\"\",Master!D279*Selection!$B$3,\"\")","v":""},"3XL-4XL",{"$f":"IF(Master!F279<>\"\",Master!F279*Selection!$B$3,\"\")","v":5.4},{"$f":"IF(Factor!#REF!<>\"\",Factor!#REF!*Selection!$B$3,\"\")","v":{"$error":"#REF!"}}]
["S90",{"$f":"IF(Selection!$B$4=\"DK\",VLOOKUP($A280,'Style navne sprog'!$A:$I,6,FALSE),IF(Selection!$B$4=\"DE\",VLOOKUP($A280,'Style navne sprog'!$A:$I,2,FALSE),IF(Selection!$B$4=\"GB\",VLOOKUP($A280,'Style navne sprog'!$A:$I,4,FALSE),IF(Selection!$B$4=\"SE\",VLOOKUP($A280,'Style navne sprog'!$A:$I,3,FALSE),IF(Selection!$B$4=\"NO\",VLOOKUP($A280,'Style navne sprog'!$A:$I,5,FALSE),IF(Selection!$B$4=\"PL\",VLOOKUP($A280,'Style navne sprog'!$A:$I,7,FALSE)))))))","v":"SEVEN SEAS Fine Twill Cadet | slim"},{"$f":"IF(Master!C280<>\"\",Master!C280*Selection!$B$3,\"\")","v":107.10000000000001},{"$f":"IF(Master!D280<>\"\",Master!D280*Selection!$B$3,\"\")","v":""},"",{"$f":"IF(Master!F280<>\"\",Master!F280*Selection!$B$3,\"\")","v":""},{"$f":"IF(Factor!#REF!<>\"\",Factor!#REF!*Selection!$B$3,\"\")","v":{"$error":"#REF!"}}]
["SS20",{"$f":"IF(Selection!$B$4=\"DK\",VLOOKUP($A281,'Style navne sprog'!$A:$I,6,FALSE),IF(Selection!$B$4=\"DE\",VLOOKUP($A281,'Style navne sprog'!$A:$I,2,FALSE),IF(Selection!$B$4=\"GB\",VLOOKUP($A281,'Style navne sprog'!$A:$I,4,FALSE),IF(Selection!$B$4=\"SE\",VLOOKUP($A281,'Style navne sprog'!$A:$I,3,FALSE),IF(Selection!$B$4=\"NO\",VLOOKUP($A281,'Style navne sprog'!$A:$I,5,FALSE),IF(Selection!$B$4=\"PL\",VLOOKUP($A281,'Style navne sprog'!$A:$I,7,FALSE)))))))","v":"SEVEN SEAS Fine Twill California | modern"},{"$f":"IF(Master!C281<>\"\",Master!C281*Selection!$B$3,\"\")","v":107.10000000000001},{"$f":"IF(Master!D281<>\"\",Master!D281*Selection!$B$3,\"\")","v":""},"3XL-5XL",{"$f":"IF(Master!F281<>\"\",Master!F281*Selection!$B$3,\"\")","v":5.4},{"$f":"IF(Factor!#REF!<>\"\",Factor!#REF!*Selection!$B$3,\"\")","v":{"$error":"#REF!"}}]
["SS254",{"$f":"IF(Selection!$B$4=\"DK\",VLOOKUP($A282,'Style navne sprog'!$A:$I,6,FALSE),IF(Selection!$B$4=\"DE\",VLOOKUP($A282,'Style navne sprog'!$A:$I,2,FALSE),IF(Selection!$B$4=\"GB\",VLOOKUP($A282,'Style navne sprog'!$A:$I,4,FALSE),IF(Selection!$B$4=\"SE\",VLOOKUP($A282,'Style navne sprog'!$A:$I,3,FALSE),IF(Selection!$B$4=\"NO\",VLOOKUP($A282,'Style navne sprog'!$A:$I,5,FALSE),IF(Selection!$B$4=\"PL\",VLOOKUP($A282,'Style navne sprog'!$A:$I,7,FALSE)))))))","v":"SEVEN SEAS Fine Twill | modern | s/s"},{"$f":"IF(Master!C282<>\"\",Master!C282*Selection!$B$3,\"\")","v":107.10000000000001},{"$f":"IF(Master!D282<>\"\",Master!D282*Selection!$B$3,\"\")","v":""},"3XL-5XL",{"$f":"IF(Master!F282<>\"\",Master!F282*Selection!$B$3,\"\")","v":5.4},{"$f":"IF(Factor!#REF!<>\"\",Factor!#REF!*Selection!$B$3,\"\")","v":{"$error":"#REF!"}}]
["SS30",{"$f":"IF(Selection!$B$4=\"DK\",VLOOKUP($A283,'Style navne sprog'!$A:$I,6,FALSE),IF(Selection!$B$4=\"DE\",VLOOKUP($A283,'Style navne sprog'!$A:$I,2,FALSE),IF(Selection!$B$4=\"GB\",VLOOKUP($A283,'Style navne sprog'!$A:$I,4,FALSE),IF(Selection!$B$4=\"SE\",VLOOKUP($A283,'Style navne sprog'!$A:$I,3,FALSE),IF(Selection!$B$4=\"NO\",VLOOKUP($A283,'Style navne sprog'!$A:$I,5,FALSE),IF(Selection!$B$4=\"PL\",VLOOKUP($A283,'Style navne sprog'!$A:$I,7,FALSE)))))))","v":"SEVEN SEAS Fine Twill | slim"},{"$f":"IF(Master!C283<>\"\",Master!C283*Selection!$B$3,\"\")","v":107.10000000000001},{"$f":"IF(Master!D283<>\"\",Master!D283*Selection!$B$3,\"\")","v":""},"",{"$f":"IF(Master!F283<>\"\",Master!F283*Selection!$B$3,\"\")","v":""},{"$f":"IF(Factor!#REF!<>\"\",Factor!#REF!*Selection!$B$3,\"\")","v":{"$error":"#REF!"}}]
["SS310",{"$f":"IF(Selection!$B$4=\"DK\",VLOOKUP($A284,'Style navne sprog'!$A:$I,6,FALSE),IF(Selection!$B$4=\"DE\",VLOOKUP($A284,'Style navne sprog'!$A:$I,2,FALSE),IF(Selection!$B$4=\"GB\",VLOOKUP($A284,'Style navne sprog'!$A:$I,4,FALSE),IF(Selection!$B$4=\"SE\",VLOOKUP($A284,'Style navne sprog'!$A:$I,3,FALSE),IF(Selection!$B$4=\"NO\",VLOOKUP($A284,'Style navne sprog'!$A:$I,5,FALSE),IF(Selection!$B$4=\"PL\",VLOOKUP($A284,'Style navne sprog'!$A:$I,7,FALSE)))))))","v":"SEVEN SEAS Royal Oxford | modern"},{"$f":"IF(Master!C284<>\"\",Master!C284*Selection!$B$3,\"\")","v":107.10000000000001},{"$f":"IF(Master!D284<>\"\",Master!D284*Selection!$B$3,\"\")","v":""},"3XL-5XL",{"$f":"IF(Master!F284<>\"\",Master!F284*Selection!$B$3,\"\")","v":5.4},{"$f":"IF(Factor!#REF!<>\"\",Factor!#REF!*Selection!$B$3,\"\")","v":{"$error":"#REF!"}}]
["SS311",{"$f":"IF(Selection!$B$4=\"DK\",VLOOKUP($A285,'Style navne sprog'!$A:$I,6,FALSE),IF(Selection!$B$4=\"DE\",VLOOKUP($A285,'Style navne sprog'!$A:$I,2,FALSE),IF(Selection!$B$4=\"GB\",VLOOKUP($A285,'Style navne sprog'!$A:$I,4,FALSE),IF(Selection!$B$4=\"SE\",VLOOKUP($A285,'Style navne sprog'!$A:$I,3,FALSE),IF(Selection!$B$4=\"NO\",VLOOKUP($A285,'Style navne sprog'!$A:$I,5,FALSE),IF(Selection!$B$4=\"PL\",VLOOKUP($A285,'Style navne sprog'!$A:$I,7,FALSE)))))))","v":"SEVEN SEAS Royal Oxford | slim"},{"$f":"IF(Master!C285<>\"\",Master!C285*Selection!$B$3,\"\")","v":107.10000000000001},{"$f":"IF(Master!D285<>\"\",Master!D285*Selection!$B$3,\"\")","v":""},"",{"$f":"IF(Master!F285<>\"\",Master!F285*Selection!$B$3,\"\")","v":""},{"$f":"IF(Factor!#REF!<>\"\",Factor!#REF!*Selection!$B$3,\"\")","v":{"$error":"#REF!"}}]
["SS37",{"$f":"IF(Selection!$B$4=\"DK\",VLOOKUP($A286,'Style navne sprog'!$A:$I,6,FALSE),IF(Selection!$B$4=\"DE\",VLOOKUP($A286,'Style navne sprog'!$A:$I,2,FALSE),IF(Selection!$B$4=\"GB\",VLOOKUP($A286,'Style navne sprog'!$A:$I,4,FALSE),IF(Selection!$B$4=\"SE\",VLOOKUP($A286,'Style navne sprog'!$A:$I,3,FALSE),IF(Selection!$B$4=\"NO\",VLOOKUP($A286,'Style navne sprog'!$A:$I,5,FALSE),IF(Selection!$B$4=\"PL\",VLOOKUP($A286,'Style navne sprog'!$A:$I,7,FALSE)))))))","v":"SEVEN SEAS Fine Twill California | slim"},{"$f":"IF(Master!C286<>\"\",Master!C286*Selection!$B$3,\"\")","v":107.10000000000001},{"$f":"IF(Master!D286<>\"\",Master!D286*Selection!$B$3,\"\")","v":""},"",{"$f":"IF(Master!F286<>\"\",Master!F286*Selection!$B$3,\"\")","v":""},{"$f":"IF(Factor!#REF!<>\"\",Factor!#REF!*Selection!$B$3,\"\")","v":{"$error":"#REF!"}}]
["SS402",{"$f":"IF(Selection!$B$4=\"DK\",VLOOKUP($A287,'Style navne sprog'!$A:$I,6,FALSE),IF(Selection!$B$4=\"DE\",VLOOKUP($A287,'Style navne sprog'!$A:$I,2,FALSE),IF(Selection!$B$4=\"GB\",VLOOKUP($A287,'Style navne sprog'!$A:$I,4,FALSE),IF(Selection!$B$4=\"SE\",VLOOKUP($A287,'Style navne sprog'!$A:$I,3,FALSE),IF(Selection!$B$4=\"NO\",VLOOKUP($A287,'Style navne sprog'!$A:$I,5,FALSE),IF(Selection!$B$4=\"PL\",VLOOKUP($A287,'Style navne sprog'!$A:$I,7,FALSE)))))))","v":"SEVEN SEAS Poplin | slim"},{"$f":"IF(Master!C287<>\"\",Master!C287*Selection!$B$3,\"\")","v":107.10000000000001},{"$f":"IF(Master!D287<>\"\",Master!D287*Selection!$B$3,\"\")","v":""},"",{"$f":"IF(Master!F287<>\"\",Master!F287*Selection!$B$3,\"\")","v":""},{"$f":"IF(Factor!#REF!<>\"\",Factor!#REF!*Selection!$B$3,\"\")","v":{"$error":"#REF!"}}]
["SS410",{"$f":"IF(Selection!$B$4=\"DK\",VLOOKUP($A288,'Style navne sprog'!$A:$I,6,FALSE),IF(Selection!$B$4=\"DE\",VLOOKUP($A288,'Style navne sprog'!$A:$I,2,FALSE),IF(Selection!$B$4=\"GB\",VLOOKUP($A288,'Style navne sprog'!$A:$I,4,FALSE),IF(Selection!$B$4=\"SE\",VLOOKUP($A288,'Style navne sprog'!$A:$I,3,FALSE),IF(Selection!$B$4=\"NO\",VLOOKUP($A288,'Style navne sprog'!$A:$I,5,FALSE),IF(Selection!$B$4=\"PL\",VLOOKUP($A288,'Style navne sprog'!$A:$I,7,FALSE)))))))","v":"SEVEN SEAS Poplin | modern | s/s"},{"$f":"IF(Master!C288<>\"\",Master!C288*Selection!$B$3,\"\")","v":107.10000000000001},{"$f":"IF(Master!D288<>\"\",Master!D288*Selection!$B$3,\"\")","v":""},"3XL-5XL",{"$f":"IF(Master!F288<>\"\",Master!F288*Selection!$B$3,\"\")","v":5.4},{"$f":"IF(Factor!#REF!<>\"\",Factor!#REF!*Selection!$B$3,\"\")","v":{"$error":"#REF!"}}]
["SS500",{"$f":"IF(Selection!$B$4=\"DK\",VLOOKUP($A289,'Style navne sprog'!$A:$I,6,FALSE),IF(Selection!$B$4=\"DE\",VLOOKUP($A289,'Style navne sprog'!$A:$I,2,FALSE),IF(Selection!$B$4=\"GB\",VLOOKUP($A289,'Style navne sprog'!$A:$I,4,FALSE),IF(Selection!$B$4=\"SE\",VLOOKUP($A289,'Style navne sprog'!$A:$I,3,FALSE),IF(Selection!$B$4=\"NO\",VLOOKUP($A289,'Style navne sprog'!$A:$I,5,FALSE),IF(Selection!$B$4=\"PL\",VLOOKUP($A289,'Style navne sprog'!$A:$I,7,FALSE)))))))","v":"SEVEN SEAS Soft Denim | modern"},{"$f":"IF(Master!C289<>\"\",Master!C289*Selection!$B$3,\"\")","v":107.10000000000001},{"$f":"IF(Master!D289<>\"\",Master!D289*Selection!$B$3,\"\")","v":""},"3XL-5XL",{"$f":"IF(Master!F289<>\"\",Master!F289*Selection!$B$3,\"\")","v":5.4},{"$f":"IF(Factor!#REF!<>\"\",Factor!#REF!*Selection!$B$3,\"\")","v":{"$error":"#REF!"}}]
["SS7",{"$f":"IF(Selection!$B$4=\"DK\",VLOOKUP($A290,'Style navne sprog'!$A:$I,6,FALSE),IF(Selection!$B$4=\"DE\",VLOOKUP($A290,'Style navne sprog'!$A:$I,2,FALSE),IF(Selection!$B$4=\"GB\",VLOOKUP($A290,'Style navne sprog'!$A:$I,4,FALSE),IF(Selection!$B$4=\"SE\",VLOOKUP($A290,'Style navne sprog'!$A:$I,3,FALSE),IF(Selection!$B$4=\"NO\",VLOOKUP($A290,'Style navne sprog'!$A:$I,5,FALSE),IF(Selection!$B$4=\"PL\",VLOOKUP($A290,'Style navne sprog'!$A:$I,7,FALSE)))))))","v":"SEVEN SEAS Poplin | modern"},{"$f":"IF(Master!C290<>\"\",Master!C290*Selection!$B$3,\"\")","v":107.10000000000001},{"$f":"IF(Master!D290<>\"\",Master!D290*Selection!$B$3,\"\")","v":""},"3XL-5XL",{"$f":"IF(Master!F290<>\"\",Master!F290*Selection!$B$3,\"\")","v":5.4},{"$f":"IF(Factor!#REF!<>\"\",Factor!#REF!*Selection!$B$3,\"\")","v":{"$error":"#REF!"}}]
["SS710",{"$f":"IF(Selection!$B$4=\"DK\",VLOOKUP($A291,'Style navne sprog'!$A:$I,6,FALSE),IF(Selection!$B$4=\"DE\",VLOOKUP($A291,'Style navne sprog'!$A:$I,2,FALSE),IF(Selection!$B$4=\"GB\",VLOOKUP($A291,'Style navne sprog'!$A:$I,4,FALSE),IF(Selection!$B$4=\"SE\",VLOOKUP($A291,'Style navne sprog'!$A:$I,3,FALSE),IF(Selection!$B$4=\"NO\",VLOOKUP($A291,'Style navne sprog'!$A:$I,5,FALSE),IF(Selection!$B$4=\"PL\",VLOOKUP($A291,'Style navne sprog'!$A:$I,7,FALSE)))))))","v":"SEVEN SEAS Poplin | modern | women"},{"$f":"IF(Master!C291<>\"\",Master!C291*Selection!$B$3,\"\")","v":107.10000000000001},{"$f":"IF(Master!D291<>\"\",Master!D291*Selection!$B$3,\"\")","v":""},"3XL-4XL",{"$f":"IF(Master!F291<>\"\",Master!F291*Selection!$B$3,\"\")","v":5.4},{"$f":"IF(Factor!#REF!<>\"\",Factor!#REF!*Selection!$B$3,\"\")","v":{"$error":"#REF!"}}]
["SS720",{"$f":"IF(Selection!$B$4=\"DK\",VLOOKUP($A292,'Style navne sprog'!$A:$I,6,FALSE),IF(Selection!$B$4=\"DE\",VLOOKUP($A292,'Style navne sprog'!$A:$I,2,FALSE),IF(Selection!$B$4=\"GB\",VLOOKUP($A292,'Style navne sprog'!$A:$I,4,FALSE),IF(Selection!$B$4=\"SE\",VLOOKUP($A292,'Style navne sprog'!$A:$I,3,FALSE),IF(Selection!$B$4=\"NO\",VLOOKUP($A292,'Style navne sprog'!$A:$I,5,FALSE),IF(Selection!$B$4=\"PL\",VLOOKUP($A292,'Style navne sprog'!$A:$I,7,FALSE)))))))","v":"SEVEN SEAS Fine Twill | modern | women"},{"$f":"IF(Master!C292<>\"\",Master!C292*Selection!$B$3,\"\")","v":107.10000000000001},{"$f":"IF(Master!D292<>\"\",Master!D292*Selection!$B$3,\"\")","v":""},"3XL-4XL",{"$f":"IF(Master!F292<>\"\",Master!F292*Selection!$B$3,\"\")","v":5.4},{"$f":"IF(Factor!#REF!<>\"\",Factor!#REF!*Selection!$B$3,\"\")","v":{"$error":"#REF!"}}]
["SS730",{"$f":"IF(Selection!$B$4=\"DK\",VLOOKUP($A293,'Style navne sprog'!$A:$I,6,FALSE),IF(Selection!$B$4=\"DE\",VLOOKUP($A293,'Style navne sprog'!$A:$I,2,FALSE),IF(Selection!$B$4=\"GB\",VLOOKUP($A293,'Style navne sprog'!$A:$I,4,FALSE),IF(Selection!$B$4=\"SE\",VLOOKUP($A293,'Style navne sprog'!$A:$I,3,FALSE),IF(Selection!$B$4=\"NO\",VLOOKUP($A293,'Style navne sprog'!$A:$I,5,FALSE),IF(Selection!$B$4=\"PL\",VLOOKUP($A293,'Style navne sprog'!$A:$I,7,FALSE)))))))","v":"SEVEN SEAS Fine Twill California | modern | women"},{"$f":"IF(Master!C293<>\"\",Master!C293*Selection!$B$3,\"\")","v":107.10000000000001},{"$f":"IF(Master!D293<>\"\",Master!D293*Selection!$B$3,\"\")","v":""},"3XL-4XL",{"$f":"IF(Master!F293<>\"\",Master!F293*Selection!$B$3,\"\")","v":5.4},{"$f":"IF(Factor!#REF!<>\"\",Factor!#REF!*Selection!$B$3,\"\")","v":{"$error":"#REF!"}}]
["SS740",{"$f":"IF(Selection!$B$4=\"DK\",VLOOKUP($A294,'Style navne sprog'!$A:$I,6,FALSE),IF(Selection!$B$4=\"DE\",VLOOKUP($A294,'Style navne sprog'!$A:$I,2,FALSE),IF(Selection!$B$4=\"GB\",VLOOKUP($A294,'Style navne sprog'!$A:$I,4,FALSE),IF(Selection!$B$4=\"SE\",VLOOKUP($A294,'Style navne sprog'!$A:$I,3,FALSE),IF(Selection!$B$4=\"NO\",VLOOKUP($A294,'Style navne sprog'!$A:$I,5,FALSE),IF(Selection!$B$4=\"PL\",VLOOKUP($A294,'Style navne sprog'!$A:$I,7,FALSE)))))))","v":"SEVEN SEAS Royal Oxford | modern | women"},{"$f":"IF(Master!C294<>\"\",Master!C294*Selection!$B$3,\"\")","v":107.10000000000001},{"$f":"IF(Master!D294<>\"\",Master!D294*Selection!$B$3,\"\")","v":""},"3XL-4XL",{"$f":"IF(Master!F294<>\"\",Master!F294*Selection!$B$3,\"\")","v":5.4},{"$f":"IF(Factor!#REF!<>\"\",Factor!#REF!*Selection!$B$3,\"\")","v":{"$error":"#REF!"}}]
["SS770",{"$f":"IF(Selection!$B$4=\"DK\",VLOOKUP($A295,'Style navne sprog'!$A:$I,6,FALSE),IF(Selection!$B$4=\"DE\",VLOOKUP($A295,'Style navne sprog'!$A:$I,2,FALSE),IF(Selection!$B$4=\"GB\",VLOOKUP($A295,'Style navne sprog'!$A:$I,4,FALSE),IF(Selection!$B$4=\"SE\",VLOOKUP($A295,'Style navne sprog'!$A:$I,3,FALSE),IF(Selection!$B$4=\"NO\",VLOOKUP($A295,'Style navne sprog'!$A:$I,5,FALSE),IF(Selection!$B$4=\"PL\",VLOOKUP($A295,'Style navne sprog'!$A:$I,7,FALSE)))))))","v":"SEVEN SEAS Soft Denim | modern | women"},{"$f":"IF(Master!C295<>\"\",Master!C295*Selection!$B$3,\"\")","v":107.10000000000001},{"$f":"IF(Master!D295<>\"\",Master!D295*Selection!$B$3,\"\")","v":""},"3XL-4XL",{"$f":"IF(Master!F295<>\"\",Master!F295*Selection!$B$3,\"\")","v":5.4},{"$f":"IF(Factor!#REF!<>\"\",Factor!#REF!*Selection!$B$3,\"\")","v":{"$error":"#REF!"}}]
["SS8",{"$f":"IF(Selection!$B$4=\"DK\",VLOOKUP($A296,'Style navne sprog'!$A:$I,6,FALSE),IF(Selection!$B$4=\"DE\",VLOOKUP($A296,'Style navne sprog'!$A:$I,2,FALSE),IF(Selection!$B$4=\"GB\",VLOOKUP($A296,'Style navne sprog'!$A:$I,4,FALSE),IF(Selection!$B$4=\"SE\",VLOOKUP($A296,'Style navne sprog'!$A:$I,3,FALSE),IF(Selection!$B$4=\"NO\",VLOOKUP($A296,'Style navne sprog'!$A:$I,5,FALSE),IF(Selection!$B$4=\"PL\",VLOOKUP($A296,'Style navne sprog'!$A:$I,7,FALSE)))))))","v":"SEVEN SEAS Fine Twill | modern"},{"$f":"IF(Master!C296<>\"\",Master!C296*Selection!$B$3,\"\")","v":107.10000000000001},{"$f":"IF(Master!D296<>\"\",Master!D296*Selection!$B$3,\"\")","v":""},"3XL-5XL",{"$f":"IF(Master!F296<>\"\",Master!F296*Selection!$B$3,\"\")","v":5.4},{"$f":"IF(Factor!#REF!<>\"\",Factor!#REF!*Selection!$B$3,\"\")","v":{"$error":"#REF!"}}]

{"sheet":"Style navne sprog","index":3,"n_rows":349,"n_cols":16,"rows_kept":349,"cut":false,"hidden":true,"merged":[]}
["SeasonCode","All"]
["AreaCode","All"]
["Item Category Code","(Multiple Items)"]
[]
[]
["StyleNo","ItemNameDE","ItemNameSE","ItemNameGB","ItemNameNO","ItemName","ItemNamePL",null,null,null,null,null,null,"Opslag Master"]
["0010","Handtuch 50x100","Handduk 50x100","Towel 50x100","Håndklæde 50x100","Håndklæde 50x100","Ręcznik 50x100",null,null,null,null,null,null,{"$f":"_xlfn.XLOOKUP(A7,Master!$A:$A,Master!$A:$A)","v":"0010"},null,{"$f":"_xlfn.XLOOKUP(A7,Master!A:A,Master!A:A)","v":"0010"}]
["0011","Badehandtuch 70x140","Badhandduk 70x140","Bath towel 70x140","Badehåndklæde 70x140","Badehåndklæde 70x140","Ręcznik kąpielowy 70x140",null,null,null,null,null,null,{"$f":"_xlfn.XLOOKUP(A8,Master!$A:$A,Master!$A:$A)","v":"0011"},null,{"$f":"_xlfn.XLOOKUP(A8,Master!A:A,Master!A:A)","v":"0011"}]
["0036","Mütze | Stretch","Mössa | stretch","Hat | stretch","Hue | stretch","Hue | stretch","Czapka | stretch",null,null,null,null,null,null,{"$f":"_xlfn.XLOOKUP(A9,Master!$A:$A,Master!$A:$A)","v":"0036"},null,{"$f":"_xlfn.XLOOKUP(A9,Master!A:A,Master!A:A)","v":"0036"}]
["0038","Halswärmer | Stretch","Halsvärmare | stretch","Neck warmer | stretch","Halsedisse | stretch","Halsedisse | stretch","Komin | stretch",null,null,null,null,null,null,{"$f":"_xlfn.XLOOKUP(A10,Master!$A:$A,Master!$A:$A)","v":"0038"},null,{"$f":"_xlfn.XLOOKUP(A10,Master!A:A,Master!A:A)","v":"0038"}]
["0040","Weicher Halswärmer","Mjuk halsvärmare","Soft neck warmer","Blød halsedisse","Blød halsedisse","Soft neck warmer",null,null,null,null,null,null,{"$f":"_xlfn.XLOOKUP(A11,Master!$A:$A,Master!$A:$A)","v":"0040"},null,{"$f":"_xlfn.XLOOKUP(A11,Master!A:A,Master!A:A)","v":"0040"}]
["0042","Strickmütze","Stickad mössa","Knitted hat","Strikhue","Strikhue","Dzianinowa czapka",null,null,null,null,null,null,{"$f":"_xlfn.XLOOKUP(A12,Master!$A:$A,Master!$A:$A)","v":"0042"},null,{"$f":"_xlfn.XLOOKUP(A12,Master!A:A,Master!A:A)","v":"0042"}]
["0044","Strickmütze | Futter","Stickad mössa | fodrad","Knitted hat | lining","Strikhue | for","Strikhue | for","Czapka wełniana | z podszewką",null,null,null,null,null,null,{"$f":"_xlfn.XLOOKUP(A13,Master!$A:$A,Master!$A:$A)","v":"0044"},null,{"$f":"_xlfn.XLOOKUP(A13,Master!A:A,Master!A:A)","v":"0044"}]
["0045","Stretchmütze","Stretch mössa","Stretch hat","Stretch hat","Stretch hat","Stretch hat",null,null,null,null,null,null,{"$f":"_xlfn.XLOOKUP(A14,Master!$A:$A,Master!$A:$A)","v":"0045"},null,{"$f":"_xlfn.XLOOKUP(A14,Master!A:A,Master!A:A)","v":"0045"}]
["0050","Urban Cap","Urban keps","Urban cap","Urban cap","Urban kasket","Urban cap",null,null,null,null,null,null,{"$f":"_xlfn.XLOOKUP(A15,Master!$A:$A,Master!$A:$A)","v":"0050"},null,{"$f":"_xlfn.XLOOKUP(A15,Master!A:A,Master!A:A)","v":"0050"}]
["0052","Golf Cap","Golfkeps","Golf cap","Golf cap","Golf cap","Czapka z daszkiem",null,null,null,null,null,null,{"$f":"_xlfn.XLOOKUP(A16,Master!$A:$A,Master!$A:$A)","v":"0052"},null,{"$f":"_xlfn.XLOOKUP(A16,Master!A:A,Master!A:A)","v":"0052"}]
["0054","Twill Cap","Twillkeps","Twill cap","Bomulds cap","Bomulds cap","Czapka z daszkiem",null,null,null,null,null,null,{"$f":"_xlfn.XLOOKUP(A17,Master!$A:$A,Master!$A:$A)","v":"0054"},null,{"$f":"_xlfn.XLOOKUP(A17,Master!A:A,Master!A:A)","v":"0054"}]
["0060","Klassischer Sonnenhut","Klassisk solhat","Classic canvas bucket hat","Klassisk bøllehat","Klassisk canvas bøllehat","Classic canvas sunhat",null,null,null,null,null,null,{"$f":"_xlfn.XLOOKUP(A18,Master!$A:$A,Master!$A:$A)","v":"0060"},null,{"$f":"_xlfn.XLOOKUP(A18,Master!A:A,Master!A:A)","v":"0060"}]
["0068","Cap | Stretch","Keps | stretch","Cap | stretch","Cap | stretch","Cap | stretch","Czapka | stretch",null,null,null,null,null,null,{"$f":"_xlfn.XLOOKUP(A19,Master!$A:$A,Master!$A:$A)","v":"0068"},null,{"$f":"_xlfn.XLOOKUP(A19,Master!A:A,Master!A:A)","v":"0068"}]
["0073","Schürze","Förkläde","Apron","Forklæde","Forklæde","Fartuch",null,null,null,null,null,null,{"$f":"_xlfn.XLOOKUP(A20,Master!$A:$A,Master!$A:$A)","v":"0073"},null,{"$f":"_xlfn.XLOOKUP(A20,Master!A:A,Master!A:A)","v":"0073"}]
["0074","Servierschürze","Serveringsförkläde","Serving apron","Serveringsforklæde","Serveringsforklæde","Fartuch kelnerski",null,null,null,null,null,null,{"$f":"_xlfn.XLOOKUP(A21,Master!$A:$A,Master!$A:$A)","v":"0074"},null,{"$f":"_xlfn.XLOOKUP(A21,Master!A:A,Master!A:A)","v":"0074"}]
["0170","Strapazierfähige Strumpfen","Slitstarke strumpor","Durable socks","Slidstærke strømper","Slidstærk strømpe"," Skarpety",null,null,null,null,null,null,{"$f":"_xlfn.XLOOKUP(A22,Master!$A:$A,Master!$A:$A)","v":"0170"},null,{"$f":"_xlfn.XLOOKUP(A22,Master!A:A,Master!A:A)","v":"0170"}]
["0204","Hemd Green Leaf | Druckknopf","Green leaf-skjorta | tryckknapp","Green leaf shirt | press stud","Green leaf skjorte | trykknap","Green leaf skjorte | trykknap","Koszula green leaf | napy",null,null,null,null,null,null,{"$f":"_xlfn.XLOOKUP(A23,Master!$A:$A,Master!$A:$A)","v":"0204"},null,{"$f":"_xlfn.XLOOKUP(A23,Master!A:A,Master!A:A)","v":"0204"}]
["0300","PRO Wear T-Shirt","PRO Wear T-shirt","PRO Wear T-shirt","PRO Wear T-shirt","PRO Wear T-shirt","T-shirt PRO Wear",null,null,null,null,null,null,{"$f":"_xlfn.XLOOKUP(A24,Master!$A:$A,Master!$A:$A)","v":"0300"},null,{"$f":"_xlfn.XLOOKUP(A24,Master!A:A,Master!A:A)","v":"0300"}]
["0302","PRO Wear T-Shirt | Kontrast","PRO Wear T-shirt | kontrast","PRO Wear T-shirt | contrast","PRO Wear T-shirt | kontrast","PRO Wear T-shirt | kontrast","T-shirt PRO Wear | kontrast",null,null,null,null,null,null,{"$f":"_xlfn.XLOOKUP(A25,Master!$A:$A,Master!$A:$A)","v":"0302"},null,{"$f":"_xlfn.XLOOKUP(A25,Master!A:A,Master!A:A)","v":"0302"}]
["0310","PRO Wear T-Shirt | light","PRO Wear T-shirt | light","PRO Wear T-shirt | light","PRO Wear T-shirt | light","PRO Wear T-shirt | light","T-shirt PRO Wear | light",null,null,null,null,null,null,{"$f":"_xlfn.XLOOKUP(A26,Master!$A:$A,Master!$A:$A)","v":"0310"},null,{"$f":"_xlfn.XLOOKUP(A26,Master!A:A,Master!A:A)","v":"0310"}]
["0311","PRO Wear T-Shirt | Langarm","PRO Wear T-shirt | l/ä","PRO Wear T-shirt | long-sleeved","PRO Wear T-shirt | l/æ","PRO Wear T-shirt | l/æ","T-shirt PRO Wear | z długim rękawem",null,null,null,null,null,null,{"$f":"_xlfn.XLOOKUP(A27,Master!$A:$A,Master!$A:$A)","v":"0311"},null,{"$f":"_xlfn.XLOOKUP(A27,Master!A:A,Master!A:A)","v":"0311"}]
["0312","PRO Wear T-Shirt | Damen","PRO Wear T-shirt | dam","PRO Wear T-shirt | women","PRO Wear T-shirt | dame","PRO Wear T-shirt | dame","T-shirt PRO Wear | damski",null,null,null,null,null,null,{"$f":"_xlfn.XLOOKUP(A28,Master!$A:$A,Master!$A:$A)","v":"0312"},null,{"$f":"_xlfn.XLOOKUP(A28,Master!A:A,Master!A:A)","v":"0312"}]
["0313","PRO Wear T-Shirt | ¾ Arm | Damen","PRO Wear T-shirt | ¾ ärm | dam","PRO Wear T-shirt | ¾ sleeve | women","PRO Wear T-shirt |¾ ærmet | dame","PRO Wear T-shirt |¾ ærmet | dame","T-shirt PRO Wear | rękaw 3/4 | damski",null,null,null,null,null,null,{"$f":"_xlfn.XLOOKUP(A29,Master!$A:$A,Master!$A:$A)","v":"0313"},null,{"$f":"_xlfn.XLOOKUP(A29,Master!A:A,Master!A:A)","v":"0313"}]
["0315","PRO Wear T-Shirt | ½ Arm | Damen","PRO Wear T-shirt | ½ ärm | dam","PRO Wear T-shirt | ½ sleeve | women","PRO Wear T-shirt | ½ ærmet | dame","PRO Wear T-shirt | ½ ærmet | dame","T-shirt PRO Wear | rękaw 1/2 | damski",null,null,null,null,null,null,{"$f":"_xlfn.XLOOKUP(A30,Master!$A:$A,Master!$A:$A)","v":"0315"},null,{"$f":"_xlfn.XLOOKUP(A30,Master!A:A,Master!A:A)","v":"0315"}]
["0317","PRO Wear T-Shirt | light | Damen","PRO Wear T-shirt | light | dam","PRO Wear T-shirt | light | women","PRO Wear T-shirt | light | dame","PRO Wear T-shirt | light | dame","T-shirt PRO Wear | light | damski",null,null,null,null,null,null,{"$f":"_xlfn.XLOOKUP(A31,Master!$A:$A,Master!$A:$A)","v":"0317"},null,{"$f":"_xlfn.XLOOKUP(A31,Master!A:A,Master!A:A)","v":"0317"}]
["0320","PRO Wear Poloshirt | Tasche","PRO Wear pikétröja | ficka","PRO Wear polo shirt | pocket","PRO Wear poloshirt  | lomme","PRO Wear poloshirt | lomme","Koszulka polo PRO Wear | kieszonka",null,null,null,null,null,null,{"$f":"_xlfn.XLOOKUP(A32,Master!$A:$A,Master!$A:$A)","v":"0320"},null,{"$f":"_xlfn.XLOOKUP(A32,Master!A:A,Master!A:A)","v":"0320"}]
["0321","PRO Wear Poloshirt | Damen","PRO Wear pikétröja | dam","PRO Wear polo shirt | women","PRO Wear poloshirt | dame","PRO Wear poloshirt | dame","Koszulka polo PRO Wear | damska",null,null,null,null,null,null,{"$f":"_xlfn.XLOOKUP(A33,Master!$A:$A,Master!$A:$A)","v":"0321"},null,{"$f":"_xlfn.XLOOKUP(A33,Master!A:A,Master!A:A)","v":"0321"}]
["0322","PRO Wear Poloshirt | Kontrast","PRO Wear pikétröja | kontrast","PRO Wear polo shirt | contrast","PRO Wear poloshirt | kontrast","PRO Wear poloshirt | kontrast","Koszulka polo PRO Wear | kontrast",null,null,null,null,null,null,{"$f":"_xlfn.XLOOKUP(A34,Master!$A:$A,Master!$A:$A)","v":"0322"},null,{"$f":"_xlfn.XLOOKUP(A34,Master!A:A,Master!A:A)","v":"0322"}]
["0324","PRO Wear Poloshirt | o. Tasche","PRO Wear pikétröja | u. ficka","PRO Wear polo shirt | no pocket","PRO Wear poloshirt | u. lomme","PRO Wear poloshirt | u. lomme","PRO Wear koszulka polo | bez kieszonki",null,null,null,null,null,null,{"$f":"_xlfn.XLOOKUP(A35,Master!$A:$A,Master!$A:$A)","v":"0324"},null,{"$f":"_xlfn.XLOOKUP(A35,Master!A:A,Master!A:A)","v":"0324"}]
["0326","PRO Wear Poloshirt | Langarm","PRO Wear pikétröja | l/ä","PRO Wear polo shirt | long-sleeve","PRO Wear poloshirt | l/æ","PRO Wear poloshirt | l/æ","Bluza polo PRO Wear | kieszonka",null,null,null,null,null,null,{"$f":"_xlfn.XLOOKUP(A36,Master!$A:$A,Master!$A:$A)","v":"0326"},null,{"$f":"_xlfn.XLOOKUP(A36,Master!A:A,Master!A:A)","v":"0326"}]
["0330","PRO Wear Poloshirt | Druckknopf","PRO Wear pikétröja | tryckknapp","PRO Wear polo shirt | press stud","PRO Wear poloshirt | trykknap","PRO Wear poloshirt | trykknap","Koszulka polo PRO Wear | napy",null,null,null,null,null,null,{"$f":"_xlfn.XLOOKUP(A37,Master!$A:$A,Master!$A:$A)","v":"0330"},null,{"$f":"_xlfn.XLOOKUP(A37,Master!A:A,Master!A:A)","v":"0330"}]
["0336","PRO Wear Langarm-Poloshirt | Druckknopf","PRO Wear l/ä pikétröja | tryckknapp","PRO Wear long-sleeve polo shirt | press stud","PRO Wear l/æ poloshirt | trykknap","PRO Wear l/æ poloshirt | trykknap","Bluza polo PRO Wear | napy",null,null,null,null,null,null,{"$f":"_xlfn.XLOOKUP(A38,Master!$A:$A,Master!$A:$A)","v":"0336"},null,{"$f":"_xlfn.XLOOKUP(A38,Master!A:A,Master!A:A)","v":"0336"}]
["0360","PRO Wear Sweatshirt | klassisch","PRO Wear sweatshirt | klassisk","PRO Wear sweatshirt | classic","PRO Wear sweatshirt | klassisk","PRO Wear sweatshirt | klassisk","Klasyczna bluza PRO Wear",null,null,null,null,null,null,{"$f":"_xlfn.XLOOKUP(A39,Master!$A:$A,Master!$A:$A)","v":"0360"},null,{"$f":"_xlfn.XLOOKUP(A39,Master!A:A,Master!A:A)","v":"0360"}]
["0362","PRO Wear Sweatshirt | Kontrast","PRO Wear sweatshirt | kontrast","PRO Wear sweatshirt | contrast","PRO Wear sweatshirt | kontrast","PRO Wear sweatshirt | kontrast","Bluza PRO Wear | kontrast",null,null,null,null,null,null,{"$f":"_xlfn.XLOOKUP(A40,Master!$A:$A,Master!$A:$A)","v":"0362"},null,{"$f":"_xlfn.XLOOKUP(A40,Master!A:A,Master!A:A)","v":"0362"}]
["0366","PRO Wear Cardigan | Sweat","PRO Wear cardigan | sweatshirt","PRO Wear cardigan | sweat","PRO Wear cardigan | sweat","PRO Wear cardigan | sweat","Rozpinana bluza PRO Wear",null,null,null,null,null,null,{"$f":"_xlfn.XLOOKUP(A41,Master!$A:$A,Master!$A:$A)","v":"0366"},null,{"$f":"_xlfn.XLOOKUP(A41,Master!A:A,Master!A:A)","v":"0366"}]
["0367","PRO Wear Cardigan | Sweat | Damen","PRO Wear cardigan | sweatshirt | dam","PRO Wear cardigan | sweat | women","PRO Wear cardigan | sweat | dame","PRO Wear cardigan | sweat | dame","Rozpinana bluza PRO Wear | damski",null,null,null,null,null,null,{"$f":"_xlfn.XLOOKUP(A42,Master!$A:$A,Master!$A:$A)","v":"0367"},null,{"$f":"_xlfn.XLOOKUP(A42,Master!A:A,Master!A:A)","v":"0367"}]
["0370","PRO Wear CARE T-Shirt","PRO Wear CARE T-shirt","PRO Wear CARE T-shirt","PRO Wear CARE T-shirt","PRO Wear CARE T-shirt","T-shirt PRO Wear CARE",null,null,null,null,null,null,{"$f":"_xlfn.XLOOKUP(A43,Master!$A:$A,Master!$A:$A)","v":"0370"},null,{"$f":"_xlfn.XLOOKUP(A43,Master!A:A,Master!A:A)","v":"0370"}]
["0371","PRO Wear CARE T-Shirt | Damen","PRO Wear CARE T-shirt | dam","PRO Wear CARE T-shirt | women","PRO Wear CARE T-shirt | dame","PRO Wear CARE T-shirt | dame","T-shirt PRO Wear CARE | damski",null,null,null,null,null,null,{"$f":"_xlfn.XLOOKUP(A44,Master!$A:$A,Master!$A:$A)","v":"0371"},null,{"$f":"_xlfn.XLOOKUP(A44,Master!A:A,Master!A:A)","v":"0371"}]
["0372","PRO Wear CARE T-Shirt | V-Ausschnitt","PRO Wear CARE T-shirt | v-ringad","PRO Wear CARE T-shirt | v-neck","PRO Wear CARE T-shirt | v-hals","PRO Wear CARE T-shirt | v-hals","T-shirt PRO Wear CARE | v-neck",null,null,null,null,null,null,{"$f":"_xlfn.XLOOKUP(A45,Master!$A:$A,Master!$A:$A)","v":"0372"},null,{"$f":"_xlfn.XLOOKUP(A45,Master!A:A,Master!A:A)","v":"0372"}]
["0373","PRO Wear CARE T-Shirt | V-Ausschnitt | Damen","PRO Wear CARE T-shirt | v-ringad | dam","PRO Wear CARE T-shirt | v-neck | women","PRO Wear CARE T-shirt | v-hals | dame","PRO Wear CARE T-shirt | v-hals | dame","T-shirt PRO Wear CARE | v-neck | damski",null,null,null,null,null,null,{"$f":"_xlfn.XLOOKUP(A46,Master!$A:$A,Master!$A:$A)","v":"0373"},null,{"$f":"_xlfn.XLOOKUP(A46,Master!A:A,Master!A:A)","v":"0373"}]
["0374","PRO Wear CARE Poloshirt","PRO Wear CARE pikétröja","PRO Wear CARE polo shirt","PRO Wear CARE poloshirt","PRO Wear CARE poloshirt","Koszulka polo PRO Wear CARE",null,null,null,null,null,null,{"$f":"_xlfn.XLOOKUP(A47,Master!$A:$A,Master!$A:$A)","v":"0374"},null,{"$f":"_xlfn.XLOOKUP(A47,Master!A:A,Master!A:A)","v":"0374"}]
["0375","PRO Wear CARE Poloshirt | Damen","PRO Wear CARE pikétröja | dam","PRO Wear CARE polo shirt | women","PRO Wear CARE poloshirt | dame","PRO Wear CARE poloshirt | dame","Koszulka polo PRO Wear CARE | damska",null,null,null,null,null,null,{"$f":"_xlfn.XLOOKUP(A48,Master!$A:$A,Master!$A:$A)","v":"0375"},null,{"$f":"_xlfn.XLOOKUP(A48,Master!A:A,Master!A:A)","v":"0375"}]
["0376","PRO Wear CARE Poloshirt | klassisch","PRO Wear CARE pikétröja | klassisk","PRO Wear CARE polo shirt | classic","PRO Wear CARE poloshirt | klassisk","PRO Wear CARE poloshirt | klassisk","Koszulka polo PRO Wear CARE | classic",null,null,null,null,null,null,{"$f":"_xlfn.XLOOKUP(A49,Master!$A:$A,Master!$A:$A)","v":"0376"},null,{"$f":"_xlfn.XLOOKUP(A49,Master!A:A,Master!A:A)","v":"0376"}]
["0377","PRO Wear CARE Poloshirt | klassisch | Damen","PRO Wear CARE pikétröja | klassisk | dam","PRO Wear CARE polo shirt | classic | women","PRO Wear CARE poloshirt | klassisk | dame","PRO Wear CARE poloshirt | klassisk | dame","Koszulka polo PRO Wear CARE | classic | damska",null,null,null,null,null,null,{"$f":"_xlfn.XLOOKUP(A50,Master!$A:$A,Master!$A:$A)","v":"0377"},null,{"$f":"_xlfn.XLOOKUP(A50,Master!A:A,Master!A:A)","v":"0377"}]
["0380","PRO Wear CARE Sweatshirt | unangeraut","PRO Wear CARE sweatshirt | oborstad","PRO Wear CARE sweatshirt | unbrushed","PRO Wear CARE sweatshirt | ubørstet","PRO Wear CARE sweatshirt | ubørstet","Bluza PRO Wear CARE | nieszczotkowana",null,null,null,null,null,null,{"$f":"_xlfn.XLOOKUP(A51,Master!$A:$A,Master!$A:$A)","v":"0380"},null,{"$f":"_xlfn.XLOOKUP(A51,Master!A:A,Master!A:A)","v":"0380"}]
["0381","PRO Wear CARE Sweatshirt | unangeraut | Damen","PRO Wear CARE sweatshirt | oborstad | dam","PRO Wear CARE sweatshirt | unbrushed | women","PRO Wear CARE sweatshirt | ubørstet | dame","PRO Wear CARE sweatshirt | ubørstet | dame","Bluza PRO Wear CARE | nieszczotkowana | damski",null,null,null,null,null,null,{"$f":"_xlfn.XLOOKUP(A52,Master!$A:$A,Master!$A:$A)","v":"0381"},null,{"$f":"_xlfn.XLOOKUP(A52,Master!A:A,Master!A:A)","v":"0381"}]
["0382","PRO Wear CARE Cardigan | unangeraut","PRO Wear CARE cardigan | oborstad","PRO Wear CARE cardigan | unbrushed","PRO Wear cardigan | ubørstet","PRO Wear CARE cardigan | ubørstet","PRO Wear CARE kardigan | nieszczotkowany",null,null,null,null,null,null,{"$f":"_xlfn.XLOOKUP(A53,Master!$A:$A,Master!$A:$A)","v":"0382"},null,{"$f":"_xlfn.XLOOKUP(A53,Master!A:A,Master!A:A)","v":"0382"}]
["0383","PRO Wear CARE Cardigan | unangeraut | Damen","PRO Wear CARE cardigan | oborstad | dam","PRO Wear CARE cardigan | unbrushed | women","PRO Wear CARE cardigan | ubørstet | dame","PRO Wear CARE cardigan | ubørstet | dame","PRO Wear CARE kardigan | nieszczotkowany | damski",null,null,null,null,null,null,{"$f":"_xlfn.XLOOKUP(A54,Master!$A:$A,Master!$A:$A)","v":"0383"},null,{"$f":"_xlfn.XLOOKUP(A54,Master!A:A,Master!A:A)","v":"0383"}]
["0384","PRO Wear CARE Cardigan | unangeraut | ¼ Zip","PRO Wear CARE cardigan | oborstad | ¼ zip","PRO Wear CARE sweat | unbrushed | ¼ zip","PRO Wear CARE sweat| ubørstet | ¼ zip","PRO Wear CARE sweat| ubørstet | ¼ zip","Bluza PRO Wear CARE | zamek ¼",null,null,null,null,null,null,{"$f":"_xlfn.XLOOKUP(A55,Master!$A:$A,Master!$A:$A)","v":"0384"},null,{"$f":"_xlfn.XLOOKUP(A55,Master!A:A,Master!A:A)","v":"0384"}]
["0385","PRO Wear CARE Cardigan | unangeraut | ¼ Zip | Dam","PRO Wear CARE cardigan | oborstad | ¼ zip | dam","PRO Wear CARE sweat  | unbrushed | ¼ zip | women","PRO Wear CARE sweat| ubørstet | ¼ zip | dame","PRO Wear CARE sweat | ubørstet | ¼ zip | dame","Bluza PRO Wear CARE | zamek ¼ | damski",null,null,null,null,null,null,{"$f":"_xlfn.XLOOKUP(A56,Master!$A:$A,Master!$A:$A)","v":"0385"},null,{"$f":"_xlfn.XLOOKUP(A56,Master!A:A,Master!A:A)","v":"0385"}]
["0500","GAME® T-Shirt","GAME® T-shirt","GAME® T-shirt","GAME® T-shirt","GAME® T-shirt","T-shirt GAME®",null,null,null,null,null,null,{"$f":"_xlfn.XLOOKUP(A57,Master!$A:$A,Master!$A:$A)","v":"0500"},null,{"$f":"_xlfn.XLOOKUP(A57,Master!A:A,Master!A:A)","v":"0500"}]
["0502","T-TIME® T-Shirt | körpernah","T-TIME® T-shirt | tight","T-TIME® T-shirt | tight","T-TIME® T-shirt | tight","T-TIME® T-shirt | tight","T-shirt T-TIME® | tight",null,null,null,null,null,null,{"$f":"_xlfn.XLOOKUP(A58,Master!$A:$A,Master!$A:$A)","v":"0502"},null,{"$f":"_xlfn.XLOOKUP(A58,Master!A:A,Master!A:A)","v":"0502"}]
["0506","Interlock T-Shirt | V-Ausschnitt | Damen","Interlock T-shirt | v-ringad | dam","Interlock T-shirt | v-neck | women","Interlock T-shirt | v-hals | dame","Interlock T-shirt | v-hals | dame","T-shirt Interlock | v-neck | damski",null,null,null,null,null,null,{"$f":"_xlfn.XLOOKUP(A59,Master!$A:$A,Master!$A:$A)","v":"0506"},null,{"$f":"_xlfn.XLOOKUP(A59,Master!A:A,Master!A:A)","v":"0506"}]
["0508","Interlock T-Shirt | Damen","Interlock T-shirt | dam","Interlock T-shirt | women","Interlock T-shirt | dame","Interlock T-shirt | dame","T-shirt Interlock | damski",null,null,null,null,null,null,{"$f":"_xlfn.XLOOKUP(A60,Master!$A:$A,Master!$A:$A)","v":"0508"},null,{"$f":"_xlfn.XLOOKUP(A60,Master!A:A,Master!A:A)","v":"0508"}]
["0509","Interlock T-Shirt | Langarm | Damen","Interlock T-shirt | l/ä | dam","Interlock T-shirt | long-sleeved | women","Interlock T-shirt | l/æ | dame","Interlock T-shirt | l/æ | dame","T-shirt Interlock | długi rękaw | damski",null,null,null,null,null,null,{"$f":"_xlfn.XLOOKUP(A61,Master!$A:$A,Master!$A:$A)","v":"0509"},null,{"$f":"_xlfn.XLOOKUP(A61,Master!A:A,Master!A:A)","v":"0509"}]
["0510","T-TIME® T-Shirt","T-TIME® T-shirt","T-TIME® T-shirt","T-TIME® T-shirt","T-TIME® T-shirt","T-shirt T-TIME®",null,null,null,null,null,null,{"$f":"_xlfn.XLOOKUP(A62,Master!$A:$A,Master!$A:$A)","v":"0510"},null,{"$f":"_xlfn.XLOOKUP(A62,Master!A:A,Master!A:A)","v":"0510"}]
["0511","T-TIME® T-Shirt | Damen","T-TIME® T-shirt | dam","T-TIME® T-shirt | women","T-TIME® T-shirt | dame","T-TIME® T-shirt | dame","T-shirt T-TIME®| damski",null,null,null,null,null,null,{"$f":"_xlfn.XLOOKUP(A63,Master!$A:$A,Master!$A:$A)","v":"0511"},null,{"$f":"_xlfn.XLOOKUP(A63,Master!A:A,Master!A:A)","v":"0511"}]
["0514","T-TIME® T-Shirt | V-Ausschnitt","T-TIME® T-shirt | v-ringad","T-TIME® T-shirt | v-neck","T-TIME® T-shirt | v-hals","T-TIME® T-shirt | v-hals","T-shirt T-TIME® | v-neck",null,null,null,null,null,null,{"$f":"_xlfn.XLOOKUP(A64,Master!$A:$A,Master!$A:$A)","v":"0514"},null,{"$f":"_xlfn.XLOOKUP(A64,Master!A:A,Master!A:A)","v":"0514"}]
["0517","Interlock T-Shirt","Interlock T-shirt","Interlock T-shirt","Interlock T-shirt","Interlock T-shirt","T-shirt Interlock",null,null,null,null,null,null,{"$f":"_xlfn.XLOOKUP(A65,Master!$A:$A,Master!$A:$A)","v":"0517"},null,{"$f":"_xlfn.XLOOKUP(A65,Master!A:A,Master!A:A)","v":"0517"}]
["0518","Interlock T-Shirt | Langarm","Interlock T-shirt | l/ä","Interlock T-shirt | long-sleeved","Interlock T-shirt |  l/æ","Interlock T-shirt | l/æ","T-shirt Interlock | długi rękaw",null,null,null,null,null,null,{"$f":"_xlfn.XLOOKUP(A66,Master!$A:$A,Master!$A:$A)","v":"0518"},null,{"$f":"_xlfn.XLOOKUP(A66,Master!A:A,Master!A:A)","v":"0518"}]
["0520","Poloshirt klassisch","Pikétröja klassisk","Polo shirt classic","Poloshirt klassisk","Poloshirt klassisk","Klasyczna koszulka polo | kieszeń",null,null,null,null,null,null,{"$f":"_xlfn.XLOOKUP(A67,Master!$A:$A,Master!$A:$A)","v":"0520"},null,{"$f":"_xlfn.XLOOKUP(A67,Master!A:A,Master!A:A)","v":"0520"}]
["0521","Poloshirt klassisch | Damen","Pikétröja klassisk | dam","Polo shirt classic | women","Poloshirt klassisk | dame","Poloshirt klassisk | dame","Klasyczna koszulka polo | damska",null,null,null,null,null,null,{"$f":"_xlfn.XLOOKUP(A68,Master!$A:$A,Master!$A:$A)","v":"0521"},null,{"$f":"_xlfn.XLOOKUP(A68,Master!A:A,Master!A:A)","v":"0521"}]
["0522","Kontrast Poloshirt | Stretch","Kontrast pikétröja | stretch","Contrast polo shirt | stretch","Kontrast poloshirt | stretch","Kontrast poloshirt | stretch","Kontrastowa koszulka polo | stretch",null,null,null,null,null,null,{"$f":"_xlfn.XLOOKUP(A69,Master!$A:$A,Master!$A:$A)","v":"0522"},null,{"$f":"_xlfn.XLOOKUP(A69,Master!A:A,Master!A:A)","v":"0522"}]
["0523","Kontrast Poloshirt | Stretch | Damen","Kontrast pikétröja | stretch | dam","Contrast polo shirt | stretch | women","Kontrast poloshirt | stretch | dame","Kontrast poloshirt | stretch | dame","Kontrastowa koszulka polo | stretch | damska",null,null,null,null,null,null,{"$f":"_xlfn.XLOOKUP(A70,Master!$A:$A,Master!$A:$A)","v":"0523"},null,{"$f":"_xlfn.XLOOKUP(A70,Master!A:A,Master!A:A)","v":"0523"}]
["0524","RE-CARE T-Shirt | unisex","RE-CARE T-shirt | unisex","RE-CARE T-shirt | unisex","RE-CARE T-shirt | unisex","RE-CARE T-shirt | unisex","T-shirt RE-CARE | unisex",null,null,null,null,null,null,{"$f":"_xlfn.XLOOKUP(A71,Master!$A:$A,Master!$A:$A)","v":"0524"},null,{"$f":"_xlfn.XLOOKUP(A71,Master!A:A,Master!A:A)","v":"0524"}]
["0525","Poloshirt | Stretch","Pikétröja | stretch","Polo shirt | stretch","Poloshirt | stretch","Poloshirt | stretch","Koszulka polo | stretch",null,null,null,null,null,null,{"$f":"_xlfn.XLOOKUP(A72,Master!$A:$A,Master!$A:$A)","v":"0525"},null,{"$f":"_xlfn.XLOOKUP(A72,Master!A:A,Master!A:A)","v":"0525"}]
["0527","Poloshirt | Stretch | Damen","Pikétröja | stretch | dam","Polo shirt | stretch | women","Poloshirt | stretch | dame","Poloshirt | stretch | dame","Koszulka polo | stretch | damska",null,null,null,null,null,null,{"$f":"_xlfn.XLOOKUP(A73,Master!$A:$A,Master!$A:$A)","v":"0527"},null,{"$f":"_xlfn.XLOOKUP(A73,Master!A:A,Master!A:A)","v":"0527"}]
["0528","T-Shirt Lyocell","T-shirt Lyocell","T-shirt Lyocell","T-shirt Lyocell","T-shirt Lyocell","T-shirt Lyocell",null,null,null,null,null,null,{"$f":"_xlfn.XLOOKUP(A74,Master!$A:$A,Master!$A:$A)","v":"0528"},null,{"$f":"_xlfn.XLOOKUP(A74,Master!A:A,Master!A:A)","v":"0528"}]
["0529","T-Shirt Lyocell | Damen","T-shirt Lyocell | dam","T-shirt Lyocell | women","T-shirt Lyocell | dame","T-shirt Lyocell | dame","T-shirt Lyocell | damski",null,null,null,null,null,null,{"$f":"_xlfn.XLOOKUP(A75,Master!$A:$A,Master!$A:$A)","v":"0529"},null,{"$f":"_xlfn.XLOOKUP(A75,Master!A:A,Master!A:A)","v":"0529"}]
["0534","Business Poloshirt | Jersey","Business pikétröja | Jersey","Business polo shirt | jersey","Business poloshirt | Jersey","Business poloshirt | Jersey","Koszulka polo biznes | Jersey",null,null,null,null,null,null,{"$f":"_xlfn.XLOOKUP(A76,Master!$A:$A,Master!$A:$A)","v":"0534"},null,{"$f":"_xlfn.XLOOKUP(A76,Master!A:A,Master!A:A)","v":"0534"}]
["0535","Business Poloshirt | Jersey | Damen","Business pikétröja | Jersey | dam","Business polo shirt | jersey | women","Business poloshirt | Jersey | dame","Business poloshirt | Jersey | dame","Koszulka polo biznes | Jersey | damska",null,null,null,null,null,null,{"$f":"_xlfn.XLOOKUP(A77,Master!$A:$A,Master!$A:$A)","v":"0535"},null,{"$f":"_xlfn.XLOOKUP(A77,Master!A:A,Master!A:A)","v":"0535"}]
["0544","Langarm Poloshirt | Stretch","Långärmad pikétröja | stretch","Long-sleeved polo shirt | stretch","Langærmet poloshirt | stretch","Langærmet poloshirt | stretch","Koszulka polo długi rękaw | stretch",null,null,null,null,null,null,{"$f":"_xlfn.XLOOKUP(A78,Master!$A:$A,Master!$A:$A)","v":"0544"},null,{"$f":"_xlfn.XLOOKUP(A78,Master!A:A,Master!A:A)","v":"0544"}]
["0545","Langarm Poloshirt | Stretch | Damen","Långärmad pikétröja | stretch | dam","Long-sleeved polo shirt | stretch | women","Langærmet poloshirt | stretch | dame","Langærmet poloshirt | stretch | dame","Koszulka polo długi rękaw | stretch | damska",null,null,null,null,null,null,{"$f":"_xlfn.XLOOKUP(A79,Master!$A:$A,Master!$A:$A)","v":"0545"},null,{"$f":"_xlfn.XLOOKUP(A79,Master!A:A,Master!A:A)","v":"0545"}]
["0546","T-TIME® T-Shirt | Rollkragen","T-TIME® T-shirt | polokrage","T-TIME® T-shirt | turtleneck","T-TIME® T-shirt | rullekrave","T-TIME® T-shirt | rullekrave","T-shirt T-TIME® | z golfem",null,null,null,null,null,null,{"$f":"_xlfn.XLOOKUP(A80,Master!$A:$A,Master!$A:$A)","v":"0546"},null,{"$f":"_xlfn.XLOOKUP(A80,Master!A:A,Master!A:A)","v":"0546"}]
["0550","T-TIME® T-Shirt | Brusttasche","T-TIME® T-shirt | bröstficka","T-TIME® T-shirt | chest pocket","T-TIME® T-shirt | brystlomme","T-TIME® T-shirt | brystlomme","T-shirt T-TIME® | kieszeń",null,null,null,null,null,null,{"$f":"_xlfn.XLOOKUP(A81,Master!$A:$A,Master!$A:$A)","v":"0550"},null,{"$f":"_xlfn.XLOOKUP(A81,Master!A:A,Master!A:A)","v":"0550"}]
["0552","T-Shirt | ökologisch","T-shirt | ekologisk","T-shirt | organic","T-shirt | økologisk","T-shirt | økologisk","T-shirt | ekologiczny",null,null,null,null,null,null,{"$f":"_xlfn.XLOOKUP(A82,Master!$A:$A,Master!$A:$A)","v":"0552"},null,{"$f":"_xlfn.XLOOKUP(A82,Master!A:A,Master!A:A)","v":"0552"}]
["0553","T-Shirt | ökologisch | Damen","T-shirt | ekologisk | dam","T-shirt | organic | women","T-shirt | økologisk | dame","T-shirt | økologisk | dame","T-shirt | ekologiczny | damski",null,null,null,null,null,null,{"$f":"_xlfn.XLOOKUP(A83,Master!$A:$A,Master!$A:$A)","v":"0553"},null,{"$f":"_xlfn.XLOOKUP(A83,Master!A:A,Master!A:A)","v":"0553"}]
["0572","Poloshirt | Active","Pikétröja | active","Polo shirt I active","Poloshirt | active","Poloshirt | active","Koszulka polo | active",null,null,null,null,null,null,{"$f":"_xlfn.XLOOKUP(A84,Master!$A:$A,Master!$A:$A)","v":"0572"},null,{"$f":"_xlfn.XLOOKUP(A84,Master!A:A,Master!A:A)","v":"0572"}]
["0573","Poloshirt | Active | Damen","Pikétröja | active | dam","Polo shirt | active | women","Poloshirt | active | dame","Poloshirt | active | dame","Koszulka polo | active | damska",null,null,null,null,null,null,{"$f":"_xlfn.XLOOKUP(A85,Master!$A:$A,Master!$A:$A)","v":"0573"},null,{"$f":"_xlfn.XLOOKUP(A85,Master!A:A,Master!A:A)","v":"0573"}]
["0586","Poloshirt | ökologisch","Pikétröja | ekologisk","Polo shirt | organic","Poloshirt | økologisk","Poloshirt | økologisk","Koszulka polo | ekologiczna",null,null,null,null,null,null,{"$f":"_xlfn.XLOOKUP(A86,Master!$A:$A,Master!$A:$A)","v":"0586"},null,{"$f":"_xlfn.XLOOKUP(A86,Master!A:A,Master!A:A)","v":"0586"}]
["0587","Poloshirt | ökologisch | Damen","Pikétröja | ekologisk | dam","Polo shirt | organic | women","Poloshirt | økologisk | dame","Poloshirt | økologisk | dame","Koszulka polo | ekologiczna | damska",null,null,null,null,null,null,{"$f":"_xlfn.XLOOKUP(A87,Master!$A:$A,Master!$A:$A)","v":"0587"},null,{"$f":"_xlfn.XLOOKUP(A87,Master!A:A,Master!A:A)","v":"0587"}]
["0594","Stretch T-Shirt | Komfort","Stretch T-shirt | komfort","Stretch T-shirt | comfort","Stretch T-shirt | komfort","Stretch T-shirt | komfort","T-shirt ze stretchem | komfort",null,null,null,null,null,null,{"$f":"_xlfn.XLOOKUP(A88,Master!$A:$A,Master!$A:$A)","v":"0594"},null,{"$f":"_xlfn.XLOOKUP(A88,Master!A:A,Master!A:A)","v":"0594"}]
["0595","Stretch T-Shirt | Komfort | Damen","Stretch T-shirt | komfort | dam","Stretch T-shirt | comfort | women","Stretch T-shirt | komfort | dame","Stretch T-shirt | komfort | dame","T-shirt ze stretchem | komfort | damski",null,null,null,null,null,null,{"$f":"_xlfn.XLOOKUP(A89,Master!$A:$A,Master!$A:$A)","v":"0595"},null,{"$f":"_xlfn.XLOOKUP(A89,Master!A:A,Master!A:A)","v":"0595"}]
["0597","Stretch T-Shirt | ¾ Ärmel | Damen","Stretch T-shirt | ¾ ärmad | dam","Stretch T-shirt | ¾ sleeved | women","Stretch T-shirt | ¾ ærmet | dame","Stretch T-shirt | ¾ ærmet | dame","T-shirt stretch | rękaw 3/4 | damski",null,null,null,null,null,null,{"$f":"_xlfn.XLOOKUP(A90,Master!$A:$A,Master!$A:$A)","v":"0597"},null,{"$f":"_xlfn.XLOOKUP(A90,Master!A:A,Master!A:A)","v":"0597"}]
["0598","Tanktop | Stretch","Tanktop | stretch","Tank top | stretch","Tanktop | stretch","Tanktop | stretch","Tank top | stretch",null,null,null,null,null,null,{"$f":"_xlfn.XLOOKUP(A91,Master!$A:$A,Master!$A:$A)","v":"0598"},null,{"$f":"_xlfn.XLOOKUP(A91,Master!A:A,Master!A:A)","v":"0598"}]
["0599","Tanktop | Stretch | Damen","Tanktop | stretch | dam","Tank top | stretch | women","Tanktop | stretch | dame","Tanktop | stretch | dame","Tank top | stretch | damski",null,null,null,null,null,null,{"$f":"_xlfn.XLOOKUP(A92,Master!$A:$A,Master!$A:$A)","v":"0599"},null,{"$f":"_xlfn.XLOOKUP(A92,Master!A:A,Master!A:A)","v":"0599"}]
["0600","Sweatshirt | klassisch","Sweatshirt | klassisk","Sweatshirt | classic","Sweatshirt | klassisk","Sweatshirt | klassisk","Klasyczna bluza",null,null,null,null,null,null,{"$f":"_xlfn.XLOOKUP(A93,Master!$A:$A,Master!$A:$A)","v":"0600"},null,{"$f":"_xlfn.XLOOKUP(A93,Master!A:A,Master!A:A)","v":"0600"}]
["0601","Polo-Sweatshirt | klassisch","Piké sweatshirt | klassisk","Polo sweatshirt | classic","Polosweatshirt | klassisk","Polosweatshirt | klassisk","Klasyczna bluza polo",null,null,null,null,null,null,{"$f":"_xlfn.XLOOKUP(A94,Master!$A:$A,Master!$A:$A)","v":"0601"},null,{"$f":"_xlfn.XLOOKUP(A94,Master!A:A,Master!A:A)","v":"0601"}]
["0603","Sweatshirt | Reißverschluss","Sweatshirt | dragkedja","Sweatshirt | zip","Sweatshirt | zip","Sweatshirt | zip","Bluza z krótkim suwakiem",null,null,null,null,null,null,{"$f":"_xlfn.XLOOKUP(A95,Master!$A:$A,Master!$A:$A)","v":"0603"},null,{"$f":"_xlfn.XLOOKUP(A95,Master!A:A,Master!A:A)","v":"0603"}]
["0604","Klassisches Sweatshirt | Baumwolle","Klassisk sweatshirt | bomull","Classic sweatshirt | cotton","Klassisk sweatshirt | bomuld","Klassisk sweatshirt | bomuld","Bluza klasyczna | bawełniana",null,null,null,null,null,null,{"$f":"_xlfn.XLOOKUP(A96,Master!$A:$A,Master!$A:$A)","v":"0604"},null,{"$f":"_xlfn.XLOOKUP(A96,Master!A:A,Master!A:A)","v":"0604"}]
["0613","Sweatshirt | Business","Sweatshirt | business","Sweatshirt | business","Sweatshirt | business","Sweatshirt | business","Ekskluzywna bluza",null,null,null,null,null,null,{"$f":"_xlfn.XLOOKUP(A97,Master!$A:$A,Master!$A:$A)","v":"0613"},null,{"$f":"_xlfn.XLOOKUP(A97,Master!A:A,Master!A:A)","v":"0613"}]
["0622","Sweat-Cardigan","Sweatshirt cardigan","Sweat cardigan","Sweat cardigan","Sweat cardigan","Bluza kardigan",null,null,null,null,null,null,{"$f":"_xlfn.XLOOKUP(A98,Master!$A:$A,Master!$A:$A)","v":"0622"},null,{"$f":"_xlfn.XLOOKUP(A98,Master!A:A,Master!A:A)","v":"0622"}]
["0624","Sweat-Cardigan | Damen","Sweatshirt cardigan | dam","Sweat cardigan | women","Sweat cardigan | dame","Sweat cardigan | dame","Bluza kardigan | damska",null,null,null,null,null,null,{"$f":"_xlfn.XLOOKUP(A99,Master!$A:$A,Master!$A:$A)","v":"0624"},null,{"$f":"_xlfn.XLOOKUP(A99,Master!A:A,Master!A:A)","v":"0624"}]
["0626","Sweat-Cardigan | Kontrast","Sweatshirt cardigan | kontrast","Sweat cardigan | contrast","Sweat cardigan | kontrast","Sweat cardigan | kontrast","Bluza kardigan | kontrastowa",null,null,null,null,null,null,{"$f":"_xlfn.XLOOKUP(A100,Master!$A:$A,Master!$A:$A)","v":"0626"},null,{"$f":"_xlfn.XLOOKUP(A100,Master!A:A,Master!A:A)","v":"0626"}]
["0627","Sweat-Cardigan | Kontrast | Damen","Sweatshirt cardigan | kontrast | dam","Sweat cardigan | contrast | women","Sweat cardigan | kontrast | dame","Sweat cardigan | kontrast | dame","Bluza kardigan | kontrastowa | damska",null,null,null,null,null,null,{"$f":"_xlfn.XLOOKUP(A101,Master!$A:$A,Master!$A:$A)","v":"0627"},null,{"$f":"_xlfn.XLOOKUP(A101,Master!A:A,Master!A:A)","v":"0627"}]
["0628","Sweat-Cardigan | Reißverschluss","Sweatshirt cardigan | dragkedja","Sweat cardigan | zip","Sweat cardigan | zip","Sweat cardigan | zip","Bluza dresowa | zip",null,null,null,null,null,null,{"$f":"_xlfn.XLOOKUP(A102,Master!$A:$A,Master!$A:$A)","v":"0628"},null,{"$f":"_xlfn.XLOOKUP(A102,Master!A:A,Master!A:A)","v":"0628"}]
["0629","Sweat-Cardigan | Reißverschluss | Damen","Sweatshirt cardigan | dragkedja | dam","Sweat cardigan | zip | women","Sweat cardigan | zip | dame","Sweat cardigan | zip | dame","Bluza dresowa | zip | damska",null,null,null,null,null,null,{"$f":"_xlfn.XLOOKUP(A103,Master!$A:$A,Master!$A:$A)","v":"0629"},null,{"$f":"_xlfn.XLOOKUP(A103,Master!A:A,Master!A:A)","v":"0629"}]
["0630","Sweat-Cardigan | eingefasst","Sweatshirt cardigan | bonded","Sweat cardigan | bonded","Sweat cardigan | bonded","Sweat cardigan | bonded","Bluza kardigan | bonded",null,null,null,null,null,null,{"$f":"_xlfn.XLOOKUP(A104,Master!$A:$A,Master!$A:$A)","v":"0630"},null,{"$f":"_xlfn.XLOOKUP(A104,Master!A:A,Master!A:A)","v":"0630"}]
["0636","CORE Hoodie","CORE hoodie","CORE hoodie","CORE hoodie","CORE hoodie","Bluza z kapturem CORE",null,null,null,null,null,null,{"$f":"_xlfn.XLOOKUP(A105,Master!$A:$A,Master!$A:$A)","v":"0636"},null,{"$f":"_xlfn.XLOOKUP(A105,Master!A:A,Master!A:A)","v":"0636"}]
["0637","CORE Hoodie | Damen","CORE hoodie| dam","CORE hoodie | women","CORE hoodie| dame","CORE hoodie | dame","Bluza z kapturem CORE | damska",null,null,null,null,null,null,{"$f":"_xlfn.XLOOKUP(A106,Master!$A:$A,Master!$A:$A)","v":"0637"},null,{"$f":"_xlfn.XLOOKUP(A106,Master!A:A,Master!A:A)","v":"0637"}]
["0638","CORE Hoodie | Reißverschluss","CORE hoodie | dragkedja","CORE hoodie | zip","CORE hoodie | zip","CORE hoodie | zip","Bluza z kapturem CORE | zip",null,null,null,null,null,null,{"$f":"_xlfn.XLOOKUP(A107,Master!$A:$A,Master!$A:$A)","v":"0638"},null,{"$f":"_xlfn.XLOOKUP(A107,Master!A:A,Master!A:A)","v":"0638"}]
["0639","CORE Hoodie | Reißverschluss | Damen","CORE hoodie | dragkedja | dam","CORE hoodie | zip | women","CORE hoodie | zip | dame","CORE hoodie | zip | dame","Bluza z kapturem CORE zip | damska",null,null,null,null,null,null,{"$f":"_xlfn.XLOOKUP(A108,Master!$A:$A,Master!$A:$A)","v":"0639"},null,{"$f":"_xlfn.XLOOKUP(A108,Master!A:A,Master!A:A)","v":"0639"}]
["0660","Hoodie | Kängurutasche | unisex","Hoodie | känguruficka | unisex","Soft hoodie | kangaroo pocket | unisex","Hoodie | kængurulomme | unisex","Soft hoodie | kængurulomme | unisex","Bluza kangurka | unisex",null,null,null,null,null,null,{"$f":"_xlfn.XLOOKUP(A109,Master!$A:$A,Master!$A:$A)","v":"0660"},null,{"$f":"_xlfn.XLOOKUP(A109,Master!A:A,Master!A:A)","v":"0660"}]
["0661","Klassische Sweathose | unisex","Klassiske sweatpants | unisex","Classic sweatpants | unisex","Klassiske sweatpants | unisex","Klassiske sweatpants | unisex","Klasyczne spodnie dresowe | unisex",null,null,null,null,null,null,{"$f":"_xlfn.XLOOKUP(A110,Master!$A:$A,Master!$A:$A)","v":"0661"},null,{"$f":"_xlfn.XLOOKUP(A110,Master!A:A,Master!A:A)","v":"0661"}]
["0682","Sweatshirt | ökologisch","Sweatshirt | ekologisk","Sweatshirt | organic","Sweatshirt | økologisk","Sweatshirt | økologisk","Bluza | ekologiczna",null,null,null,null,null,null,{"$f":"_xlfn.XLOOKUP(A111,Master!$A:$A,Master!$A:$A)","v":"0682"},null,{"$f":"_xlfn.XLOOKUP(A111,Master!A:A,Master!A:A)","v":"0682"}]
["0683","Sweatshirt | ökologisch | Damen","Sweatshirt | ekologisk | dam","Sweatshirt | organic | women","Sweatshirt | økologisk | dame","Sweatshirt | økologisk | dame","Bluza | ekologiczna | damska",null,null,null,null,null,null,{"$f":"_xlfn.XLOOKUP(A112,Master!$A:$A,Master!$A:$A)","v":"0683"},null,{"$f":"_xlfn.XLOOKUP(A112,Master!A:A,Master!A:A)","v":"0683"}]
["0712","Zip-n-Mix Shell-Jacke","Zip-n-Mix skaljacka","Zip-n-Mix shell Jacket","Zip-n-Mix skaljakke","Zip-n-Mix skaljakke","Kurtka z membraną Zip-n-Mix",null,null,null,null,null,null,{"$f":"_xlfn.XLOOKUP(A113,Master!$A:$A,Master!$A:$A)","v":"0712"},null,{"$f":"_xlfn.XLOOKUP(A113,Master!A:A,Master!A:A)","v":"0712"}]
["0713","Zip-n-Mix Shell-Jacke | Damen","Zip-n-Mix skaljacka | dam","Zip-n-Mix shell jacket | women","Zip-n-Mix skaljakke | dame","Zip-n-Mix skaljakke | dame","Kurtka z membraną Zip-n-Mix | damska",null,null,null,null,null,null,{"$f":"_xlfn.XLOOKUP(A114,Master!$A:$A,Master!$A:$A)","v":"0713"},null,{"$f":"_xlfn.XLOOKUP(A114,Master!A:A,Master!A:A)","v":"0713"}]
["0714","Zip-n-Mix Hose | unisex","Zip-n-Mix byxor | unisex","Zip-n-Mix pants | unisex","Zip-n-Mix buks | unisex","Zip-n-Mix buks | unisex","Spodnie Zip-n-Mix | unisex",null,null,null,null,null,null,{"$f":"_xlfn.XLOOKUP(A115,Master!$A:$A,Master!$A:$A)","v":"0714"},null,{"$f":"_xlfn.XLOOKUP(A115,Master!A:A,Master!A:A)","v":"0714"}]
["0720","Hybrid Jacke","Hybrid jacka","Hybrid jacket","Hybrid jakke","Hybrid jakke","Kurtka Hybrid",null,null,null,null,null,null,{"$f":"_xlfn.XLOOKUP(A116,Master!$A:$A,Master!$A:$A)","v":"0720"},null,{"$f":"_xlfn.XLOOKUP(A116,Master!A:A,Master!A:A)","v":"0720"}]
["0721","Hybrid Jacke | Damen","Hybrid jacka | dam","Hybrid jacket | women","Hybrid jakke | dame","Hybrid jakke | dame","Kurtka Hybrid | damska",null,null,null,null,null,null,{"$f":"_xlfn.XLOOKUP(A117,Master!$A:$A,Master!$A:$A)","v":"0721"},null,{"$f":"_xlfn.XLOOKUP(A117,Master!A:A,Master!A:A)","v":"0721"}]
["0744","Fleecejacke | eingefasst","Fleecejacka | bonded","Bonded fleece jacket","Bonded fleecejakke","Bonded fleecejakke","Kurtka bonded fleece",null,null,null,null,null,null,{"$f":"_xlfn.XLOOKUP(A118,Master!$A:$A,Master!$A:$A)","v":"0744"},null,{"$f":"_xlfn.XLOOKUP(A118,Master!A:A,Master!A:A)","v":"0744"}]
["0745","Fleecejacke | eingefasst | Damen","Fleecejacka | bonded | dam","Bonded fleece jacket | women","Bonded fleecejakke | dame","Bonded fleecejakke | dame","Kurtka bonded fleece | damski",null,null,null,null,null,null,{"$f":"_xlfn.XLOOKUP(A119,Master!$A:$A,Master!$A:$A)","v":"0745"},null,{"$f":"_xlfn.XLOOKUP(A119,Master!A:A,Master!A:A)","v":"0745"}]
["0746","Fleeceweste | eingefasst","Fleeceväst | bonded","Bonded fleece vest","Bonded fleecevest","Bonded fleecevest","Bezrękawnik bonded fleece",null,null,null,null,null,null,{"$f":"_xlfn.XLOOKUP(A120,Master!$A:$A,Master!$A:$A)","v":"0746"},null,{"$f":"_xlfn.XLOOKUP(A120,Master!A:A,Master!A:A)","v":"0746"}]
["0747","Fleeceweste | eingefasst | Damen","Fleeceväst | bonded | dam","Bonded fleece vest | women","Bonded fleecevest | dame","Bonded fleecevest | dame","Bezrękawnik bonded fleece | damski",null,null,null,null,null,null,{"$f":"_xlfn.XLOOKUP(A121,Master!$A:$A,Master!$A:$A)","v":"0747"},null,{"$f":"_xlfn.XLOOKUP(A121,Master!A:A,Master!A:A)","v":"0747"}]
["0780","Zip-n-Mix Jacke | Hybrid","Zip-n-Mix jacka | hybrid","Zip-n-Mix jacket | hybrid","Zip-n-Mix jakke | hybrid","Zip-n-Mix jakke | hybrid","Kurtka Zip-n-Mix | hybrid",null,null,null,null,null,null,{"$f":"_xlfn.XLOOKUP(A122,Master!$A:$A,Master!$A:$A)","v":"0780"},null,{"$f":"_xlfn.XLOOKUP(A122,Master!A:A,Master!A:A)","v":"0780"}]
["0781","Zip-n-Mix Jacke | Hybrid | Damen","Zip-n-Mix jacka | hybrid | dam","Zip-n-Mix jacket | hybrid | women","Zip-n-Mix jakke | hybrid | dame","Zip-n-Mix jakke | hybrid | dame","Kurtka Zip-n-Mix | hybrid | damska",null,null,null,null,null,null,{"$f":"_xlfn.XLOOKUP(A123,Master!$A:$A,Master!$A:$A)","v":"0781"},null,{"$f":"_xlfn.XLOOKUP(A123,Master!A:A,Master!A:A)","v":"0781"}]
["0792","Zip-n-Mix Microfleece | Reflex","Zip-n-Mix mikrofleece | reflex","Zip-n-Mix microfleece | reflective","Zip-n-Mix mikrofleece | refleks","Zip-n-Mix mikrofleece | refleks","Mikropolar Zip-n-Mix | elementy odblaskowe",null,null,null,null,null,null,{"$f":"_xlfn.XLOOKUP(A124,Master!$A:$A,Master!$A:$A)","v":"0792"},null,{"$f":"_xlfn.XLOOKUP(A124,Master!A:A,Master!A:A)","v":"0792"}]
["0793","Zip-n-Mix Microfleece | Reflex | Damen","Zip-n-Mix mikrofleece | reflex | dam","Zip-n-Mix  microfleece | reflective | women","Zip-n-Mix mikrofleece | refleks | dame","Zip-n-Mix mikrofleece | refleks | dame","Mikropolar Zip-n-Mix | elementy odblaskow | damska",null,null,null,null,null,null,{"$f":"_xlfn.XLOOKUP(A125,Master!$A:$A,Master!$A:$A)","v":"0793"},null,{"$f":"_xlfn.XLOOKUP(A125,Master!A:A,Master!A:A)","v":"0793"}]
["0803","Cardigan | Microfleece","Cardigan | microfleece","Cardigan | microfleece","Cardigan | mikrofleece","Cardigan | mikrofleece","Bluza z mikropolaru",null,null,null,null,null,null,{"$f":"_xlfn.XLOOKUP(A126,Master!$A:$A,Master!$A:$A)","v":"0803"},null,{"$f":"_xlfn.XLOOKUP(A126,Master!A:A,Master!A:A)","v":"0803"}]
["0805","Cardigan | Microfleece | Damen","Cardigan | mikrofleece | dam","Cardigan | microfleece | women","Cardigan | mikrofleece | dame","Cardigan | mikrofleece | dame","Bluza z mikropolaru | damski",null,null,null,null,null,null,{"$f":"_xlfn.XLOOKUP(A127,Master!$A:$A,Master!$A:$A)","v":"0805"},null,{"$f":"_xlfn.XLOOKUP(A127,Master!A:A,Master!A:A)","v":"0805"}]
["0806","Zip-n-Mix Microfleece","Zip-n-Mix microfleece","Zip-n-Mix microfleece","Zip-n-Mix mikrofleece","Zip-n-Mix mikrofleece","Mikropolar Zip-n-Mix",null,null,null,null,null,null,{"$f":"_xlfn.XLOOKUP(A128,Master!$A:$A,Master!$A:$A)","v":"0806"},null,{"$f":"_xlfn.XLOOKUP(A128,Master!A:A,Master!A:A)","v":"0806"}]
["0807","Zip-n-Mix Microfleece | Damen","Zip-n-Mix microfleece | dam","Zip-n-Mix microfleece | women","Zip-n-Mix mikrofleece | dame","Zip-n-Mix mikrofleece | dame","Mikropolar Zip-n-Mix | damski",null,null,null,null,null,null,{"$f":"_xlfn.XLOOKUP(A129,Master!$A:$A,Master!$A:$A)","v":"0807"},null,{"$f":"_xlfn.XLOOKUP(A129,Master!A:A,Master!A:A)","v":"0807"}]
["0808","Fleece Tunika | unisex","Fleece tunika | unisex","Fleece tunic | unisex","Fleece tunika | unisex","Fleece tunika | unisex","Tunika polarowa | unisex",null,null,null,null,null,null,{"$f":"_xlfn.XLOOKUP(A130,Master!$A:$A,Master!$A:$A)","v":"0808"},null,{"$f":"_xlfn.XLOOKUP(A130,Master!A:A,Master!A:A)","v":"0808"}]
["0809","Fleece Bolerojacke | unisex","Fleece bolero | unisex","Fleece bolero | unisex","Fleece bolero | unisex","Fleece Bolero | unisex","Fleece bolero | unisex",null,null,null,null,null,null,{"$f":"_xlfn.XLOOKUP(A131,Master!$A:$A,Master!$A:$A)","v":"0809"},null,{"$f":"_xlfn.XLOOKUP(A131,Master!A:A,Master!A:A)","v":"0809"}]
["0811","Active Weste | Microfleece","Active väst | microfleece","Active vest | microfleece","Active vest | mikrofleece","Active vest | mikrofleece","Kamizelka z mikropolaru | active",null,null,null,null,null,null,{"$f":"_xlfn.XLOOKUP(A132,Master!$A:$A,Master!$A:$A)","v":"0811"},null,{"$f":"_xlfn.XLOOKUP(A132,Master!A:A,Master!A:A)","v":"0811"}]
["0812","Active Weste | Microfleece | Damen","Active väst | microfleece | dam","Active vest | microfleece | women","Active vest | microfleece | dame","Active vest | mikrofleece | dame","Kamizelka z mikropolaru | active | damska",null,null,null,null,null,null,{"$f":"_xlfn.XLOOKUP(A133,Master!$A:$A,Master!$A:$A)","v":"0812"},null,{"$f":"_xlfn.XLOOKUP(A133,Master!A:A,Master!A:A)","v":"0812"}]
["0824","Soft Shell-Weste | funktional","Soft shell-väst | funktionell","Soft shell vest | functional","Softshell vest | funktionel","Softshell vest | funktionel","Kamizelka soft shell | funkcjonalna",null,null,null,null,null,null,{"$f":"_xlfn.XLOOKUP(A134,Master!$A:$A,Master!$A:$A)","v":"0824"},null,{"$f":"_xlfn.XLOOKUP(A134,Master!A:A,Master!A:A)","v":"0824"}]
["0825","Soft Shell-Weste | funktional | Damen","Soft shell-väst | funktionell | dam","Soft shell vest | functional | women","Softshell vest | funktionel | dame","Softshell vest | funktionel | dame","Kamizelka soft shell | funkcjonalna | damska",null,null,null,null,null,null,{"$f":"_xlfn.XLOOKUP(A135,Master!$A:$A,Master!$A:$A)","v":"0825"},null,{"$f":"_xlfn.XLOOKUP(A135,Master!A:A,Master!A:A)","v":"0825"}]
["0826","Fleecejacke | Gesteppt","Fleecejacka | quiltad","Fleece jacket | quilted","Fleecejakke | quiltet","Fleecejakke | quiltet","Pikowana kurtka polarowa",null,null,null,null,null,null,{"$f":"_xlfn.XLOOKUP(A136,Master!$A:$A,Master!$A:$A)","v":"0826"},null,{"$f":"_xlfn.XLOOKUP(A136,Master!A:A,Master!A:A)","v":"0826"}]
["0827","Fleecejacke | Gesteppt | Damen","Fleecejacka | quiltad | dam","Fleece jacket | quilted | women","Fleecejakke | quiltet | dame","Fleecejakke | quiltet | dame","Pikowana kurtka polarowa | damska",null,null,null,null,null,null,{"$f":"_xlfn.XLOOKUP(A137,Master!$A:$A,Master!$A:$A)","v":"0827"},null,{"$f":"_xlfn.XLOOKUP(A137,Master!A:A,Master!A:A)","v":"0827"}]
["0828","Pile Fleecejacke","Pilefleece-jacka","Pile fleece jacket","Pile fleece jakke","Pile fleece jakke","Kurtka polarowa Pile",null,null,null,null,null,null,{"$f":"_xlfn.XLOOKUP(A138,Master!$A:$A,Master!$A:$A)","v":"0828"},null,{"$f":"_xlfn.XLOOKUP(A138,Master!A:A,Master!A:A)","v":"0828"}]
["0829","Pile Fleecejacke | Damen","Pilefleece-jacka | dam","Pile fleece jacket I women","Pile fleece jakke | dame","Pile fleece jakke | dame","Kurtka polarowa Pile | damska",null,null,null,null,null,null,{"$f":"_xlfn.XLOOKUP(A139,Master!$A:$A,Master!$A:$A)","v":"0829"},null,{"$f":"_xlfn.XLOOKUP(A139,Master!A:A,Master!A:A)","v":"0829"}]
["0830","Regenjacke | Performance","Regnjacka | performance","Rain jacket | performance","Regnjakke | performance","Regnjakke | performance","Kurtka przeciwdeszczowa | performance",null,null,null,null,null,null,{"$f":"_xlfn.XLOOKUP(A140,Master!$A:$A,Master!$A:$A)","v":"0830"},null,{"$f":"_xlfn.XLOOKUP(A140,Master!A:A,Master!A:A)","v":"0830"}]
["0831","Regenjacke | Performance | Damen","Regnjacka | performance | dam","Rain jacket | performance | women","Regnjakke | performance | dame","Regnjakke | performance | dame","Kurtka przeciwdeszczowa | performance | damska",null,null,null,null,null,null,{"$f":"_xlfn.XLOOKUP(A141,Master!$A:$A,Master!$A:$A)","v":"0831"},null,{"$f":"_xlfn.XLOOKUP(A141,Master!A:A,Master!A:A)","v":"0831"}]
["0836","Soft Shell-Jacke | light","Soft shell-jacka | light","Soft shell jacket | light","Softshell jakke | letvægts","Softshell jakke | letvægt","Kurtka soft shell z kapturem | lekka",null,null,null,null,null,null,{"$f":"_xlfn.XLOOKUP(A142,Master!$A:$A,Master!$A:$A)","v":"0836"},null,{"$f":"_xlfn.XLOOKUP(A142,Master!A:A,Master!A:A)","v":"0836"}]
["0837","Soft Shell-Jacke | light | Damen","Soft shell-jacka | light | dam","Soft shell jacket | light | women","Softshell jakke | letvægts | dame","Softshell jakke | letvægt | dame","Kurtka soft shell z kapturem| lekka | damska",null,null,null,null,null,null,{"$f":"_xlfn.XLOOKUP(A143,Master!$A:$A,Master!$A:$A)","v":"0837"},null,{"$f":"_xlfn.XLOOKUP(A143,Master!A:A,Master!A:A)","v":"0837"}]
["0840","Cardigan | Stretch Komfort","Cardigan | stretch komfort","Cardigan | stretch comfort","Cardigan | stretch komfort","Cardigan | stretch komfort","Bluza | stretch komfort",null,null,null,null,null,null,{"$f":"_xlfn.XLOOKUP(A144,Master!$A:$A,Master!$A:$A)","v":"0840"},null,{"$f":"_xlfn.XLOOKUP(A144,Master!A:A,Master!A:A)","v":"0840"}]
["0841","Cardigan | Stretch Komfort | Damen","Cardigan | stretch komfort | dam","Cardigan | stretch comfort | women","Cardigan | stretch komfort | dame","Cardigan | stretch komfort | dame","Bluza | stretch komfort | damska",null,null,null,null,null,null,{"$f":"_xlfn.XLOOKUP(A145,Master!$A:$A,Master!$A:$A)","v":"0841"},null,{"$f":"_xlfn.XLOOKUP(A145,Master!A:A,Master!A:A)","v":"0841"}]
["0842","Kapuzen Winterjacke","Hoddad vinterjacka","Hooded winter jacket","Hooded vinterjakke","Hooded vinterjakke","Kurtka zimowa z kapturem",null,null,null,null,null,null,{"$f":"_xlfn.XLOOKUP(A146,Master!$A:$A,Master!$A:$A)","v":"0842"},null,{"$f":"_xlfn.XLOOKUP(A146,Master!A:A,Master!A:A)","v":"0842"}]
["0843","Kapuzen Winterjacke | Damen","Hoddad vinterjacka | dam","Hooded winter jacket | women","Hooded vinterjakke  | dame","Hooded vinterjakke  | dame","Kurtka zimowa z kapturem | damska",null,null,null,null,null,null,{"$f":"_xlfn.XLOOKUP(A147,Master!$A:$A,Master!$A:$A)","v":"0843"},null,{"$f":"_xlfn.XLOOKUP(A147,Master!A:A,Master!A:A)","v":"0843"}]
["0847","Zip-n-Mix Fleece | Melange","Zip-n-Mix fleece | melange","Zip-n-Mix fleece | melange","Zip-n-Mix fleece | melange","Zip-n-Mix fleece | melange","Polar Zip-n-Mix | melange",null,null,null,null,null,null,{"$f":"_xlfn.XLOOKUP(A148,Master!$A:$A,Master!$A:$A)","v":"0847"},null,{"$f":"_xlfn.XLOOKUP(A148,Master!A:A,Master!A:A)","v":"0847"}]
["0848","Zip-n-Mix Fleece | Melange | Damen","Zip-n-Mix fleece | melange | dam","Zip-n-Mix fleece | melange | women","Zip-n-Mix fleece | melange | dame","Zip-n-Mix fleece | melange | dame","Polar Zip-n-Mix | melange | damski",null,null,null,null,null,null,{"$f":"_xlfn.XLOOKUP(A149,Master!$A:$A,Master!$A:$A)","v":"0848"},null,{"$f":"_xlfn.XLOOKUP(A149,Master!A:A,Master!A:A)","v":"0848"}]
["0850","Cardigan | Strick-Fleece","Cardigan | stickad fleece","Cardigan | knit fleece","Cardigan | strikfleece","Cardigan | strikfleece","Bluza z polaru",null,null,null,null,null,null,{"$f":"_xlfn.XLOOKUP(A150,Master!$A:$A,Master!$A:$A)","v":"0850"},null,{"$f":"_xlfn.XLOOKUP(A150,Master!A:A,Master!A:A)","v":"0850"}]
["0851","Cardigan | Strick-Fleece | Damen","Cardigan | stickad fleece | dam","Cardigan | knit fleece | women","Cardigan | strikfleece | dame","Cardigan | strikfleece | dame","Bluza z polaru | damski",null,null,null,null,null,null,{"$f":"_xlfn.XLOOKUP(A151,Master!$A:$A,Master!$A:$A)","v":"0851"},null,{"$f":"_xlfn.XLOOKUP(A151,Master!A:A,Master!A:A)","v":"0851"}]
["0854","CORE Soft Shell-Jacke","CORE soft shell-jacka","CORE soft shell jacket","CORE softshell jakke","CORE softshell jakke","Kurtka soft shell CORE",null,null,null,null,null,null,{"$f":"_xlfn.XLOOKUP(A152,Master!$A:$A,Master!$A:$A)","v":"0854"},null,{"$f":"_xlfn.XLOOKUP(A152,Master!A:A,Master!A:A)","v":"0854"}]
["0856","CORE Soft Shell-Jacke | Damen","CORE soft shell-jacka | dam","CORE soft shell jacket| women","CORE softshell jakke | dame","CORE softshell jakke| dame","Kurtka soft shell CORE | damska",null,null,null,null,null,null,{"$f":"_xlfn.XLOOKUP(A153,Master!$A:$A,Master!$A:$A)","v":"0856"},null,{"$f":"_xlfn.XLOOKUP(A153,Master!A:A,Master!A:A)","v":"0856"}]
["0868","Soft Shell-Jacke | Performance","Soft shell-jacka | performance","Soft shell jacket | performance","Softshell jakke | performance","Softshell jakke | performance","Kurtka soft shell | performance",null,null,null,null,null,null,{"$f":"_xlfn.XLOOKUP(A154,Master!$A:$A,Master!$A:$A)","v":"0868"},null,{"$f":"_xlfn.XLOOKUP(A154,Master!A:A,Master!A:A)","v":"0868"}]
["0869","Soft Shell-Jacke | Performance | Damen","Soft shell-jacka | performance | dam","Soft shell jacket | performance | women","Softshell jakke | performance | dame","Softshell jakke | performance | dame","Kurtka soft shell | performance | damska",null,null,null,null,null,null,{"$f":"_xlfn.XLOOKUP(A155,Master!$A:$A,Master!$A:$A)","v":"0869"},null,{"$f":"_xlfn.XLOOKUP(A155,Master!A:A,Master!A:A)","v":"0869"}]
["0892","Bodywarmer | Stretch","Bodywarmer | stretch","Bodywarmer | stretch","Bodywarmer | stretch","Bodywarmer | stretch","Kamizelka pikowana | stretch",null,null,null,null,null,null,{"$f":"_xlfn.XLOOKUP(A156,Master!$A:$A,Master!$A:$A)","v":"0892"},null,{"$f":"_xlfn.XLOOKUP(A156,Master!A:A,Master!A:A)","v":"0892"}]
["0893","Bodywarmer | Stretch | Damen","Bodywarmer | stretch | dam","Bodywarmer | stretch | women","Bodywarmer | stretch | dame","Bodywarmer | stretch | dame","Kamizelka pikowana | stretch | damska",null,null,null,null,null,null,{"$f":"_xlfn.XLOOKUP(A157,Master!$A:$A,Master!$A:$A)","v":"0893"},null,{"$f":"_xlfn.XLOOKUP(A157,Master!A:A,Master!A:A)","v":"0893"}]
["0896","Gefütterte Jacke | Stretch","Vadderad jacka | stretch","Padded jacket | stretch","Padded jakke | stretch","Padded jakke | stretch","Kurtka pikowana | stretch",null,null,null,null,null,null,{"$f":"_xlfn.XLOOKUP(A158,Master!$A:$A,Master!$A:$A)","v":"0896"},null,{"$f":"_xlfn.XLOOKUP(A158,Master!A:A,Master!A:A)","v":"0896"}]
["0897","Gefütterte Jacke | Stretch | Damen","Vadderad jacka | stretch | dam","Padded jacket | stretch | women","Padded jakke | stretch | dame","Padded jakke | stretch | dame","Kurtka pikowana | stretch | damska",null,null,null,null,null,null,{"$f":"_xlfn.XLOOKUP(A159,Master!$A:$A,Master!$A:$A)","v":"0897"},null,{"$f":"_xlfn.XLOOKUP(A159,Master!A:A,Master!A:A)","v":"0897"}]
["0898","Soft Shell-Jacke | Winter","Soft shell-jacka | vinter","Soft shell jacket | winter","Softshell jakke | vinter","Softshell jakke | vinter","Kurtka soft shell | zimowa",null,null,null,null,null,null,{"$f":"_xlfn.XLOOKUP(A160,Master!$A:$A,Master!$A:$A)","v":"0898"},null,{"$f":"_xlfn.XLOOKUP(A160,Master!A:A,Master!A:A)","v":"0898"}]
["0899","Soft Shell-Jacke | Winter | Damen","Soft shell-jacka | vinter | dam","Soft shell jacket | winter | women","Softshell jakke | vinter | dame","Softshell jakke | vinter | dame","Kurtka soft shell | zimowa | damska",null,null,null,null,null,null,{"$f":"_xlfn.XLOOKUP(A161,Master!$A:$A,Master!$A:$A)","v":"0899"},null,{"$f":"_xlfn.XLOOKUP(A161,Master!A:A,Master!A:A)","v":"0899"}]
["0902","Hybrid Stretchhose","Hybrid stretchbyxa","Hybrid stretch pants","Hybrid stretch buks","Hybrid stretch buks","Spodnie hybrid stretch",null,null,null,null,null,null,{"$f":"_xlfn.XLOOKUP(A162,Master!$A:$A,Master!$A:$A)","v":"0902"},null,{"$f":"_xlfn.XLOOKUP(A162,Master!A:A,Master!A:A)","v":"0902"}]
["0903","Hybrid Stretchhose | Damen","Hybrid stretchbyxa | dam","Hybrid stretch pants | women","Hybrid stretch buks | dame","Hybrid stretch buks | dame","Spodnie hybrid stretch | damskie",null,null,null,null,null,null,{"$f":"_xlfn.XLOOKUP(A163,Master!$A:$A,Master!$A:$A)","v":"0903"},null,{"$f":"_xlfn.XLOOKUP(A163,Master!A:A,Master!A:A)","v":"0903"}]
["0907","Stretchhose | multifunktional | unisex","Stretchbyxa | multifunktionell | unisex","Stretch pants | multifunctional | unisex","Stretch buks | multifunktionel | unisex","Stretch buks | multifunktionel | unisex","Spodnie stretch | wielofunkcyjne | unisex",null,null,null,null,null,null,{"$f":"_xlfn.XLOOKUP(A164,Master!$A:$A,Master!$A:$A)","v":"0907"},null,{"$f":"_xlfn.XLOOKUP(A164,Master!A:A,Master!A:A)","v":"0907"}]
["0910","CORE Stretchhose","CORE stretch byxor","CORE stretch pants","CORE stretch buks","CORE stretch buks","Spodnie stretch CORE",null,null,null,null,null,null,{"$f":"_xlfn.XLOOKUP(A165,Master!$A:$A,Master!$A:$A)","v":"0910"},null,{"$f":"_xlfn.XLOOKUP(A165,Master!A:A,Master!A:A)","v":"0910"}]
["0911","CORE Stretchhose | Damen","CORE stretch byxor | dam","CORE stretch pants | women","CORE stretch buks | dame","CORE stretch buks | dame","Spodnie stretch CORE | damskie",null,null,null,null,null,null,{"$f":"_xlfn.XLOOKUP(A166,Master!$A:$A,Master!$A:$A)","v":"0911"},null,{"$f":"_xlfn.XLOOKUP(A166,Master!A:A,Master!A:A)","v":"0911"}]
["0912","CORE Stretchshorts","CORE stretch shorts","CORE stretch shorts","CORE stretch shorts","CORE stretch shorts","Szorty stretch CORE",null,null,null,null,null,null,{"$f":"_xlfn.XLOOKUP(A167,Master!$A:$A,Master!$A:$A)","v":"0912"},null,{"$f":"_xlfn.XLOOKUP(A167,Master!A:A,Master!A:A)","v":"0912"}]
["0913","CORE Stretchshorts | Damen","CORE stretch shorts | dam","CORE stretch shorts | women","CORE stretch shorts | dame","CORE stretch shorts | dame","Szorty stretch CORE | damskie",null,null,null,null,null,null,{"$f":"_xlfn.XLOOKUP(A168,Master!$A:$A,Master!$A:$A)","v":"0913"},null,{"$f":"_xlfn.XLOOKUP(A168,Master!A:A,Master!A:A)","v":"0913"}]
["0914","Cargo Stretchhose | unisex","Cargo stretchbyxor | unisex","Cargo stretch pants | unisex","Cargo stretch buks | unisex","Cargo stretch buks | unisex","Spodnie cargo stretch | unisex",null,null,null,null,null,null,{"$f":"_xlfn.XLOOKUP(A169,Master!$A:$A,Master!$A:$A)","v":"0914"},null,{"$f":"_xlfn.XLOOKUP(A169,Master!A:A,Master!A:A)","v":"0914"}]
["1510","Baumwolltasche","Kasse i bomull","Cotton bag","Bomuldspose","Bomuldspose","Bawełniana torba",null,null,null,null,null,null,{"$f":"_xlfn.XLOOKUP(A170,Master!$A:$A,Master!$A:$A)","v":"1510"},null,{"$f":"_xlfn.XLOOKUP(A170,Master!A:A,Master!A:A)","v":"1510"}]
["1800","Sporttasche","Sportväska","Sports bag","Sportstaske","Sportstaske","Torba sportowa",null,null,null,null,null,null,{"$f":"_xlfn.XLOOKUP(A171,Master!$A:$A,Master!$A:$A)","v":"1800"},null,{"$f":"_xlfn.XLOOKUP(A171,Master!A:A,Master!A:A)","v":"1800"}]
["1802","Große Sporttasche | Trolley","Stor sportväska | hjul","Large sports bag | trolley","Stor sportstaske | trolley","Stor sportstaske | trolley","Duża torba na kółkach",null,null,null,null,null,null,{"$f":"_xlfn.XLOOKUP(A172,Master!$A:$A,Master!$A:$A)","v":"1802"},null,{"$f":"_xlfn.XLOOKUP(A172,Master!A:A,Master!A:A)","v":"1802"}]
["1805","Ripstop-Rucksack","Ripstop ryggsäck","Ripstop backpack","Ripstop rygsæk","Ripstop rygsæk","Plecak Ripstop",null,null,null,null,null,null,{"$f":"_xlfn.XLOOKUP(A173,Master!$A:$A,Master!$A:$A)","v":"1805"},null,{"$f":"_xlfn.XLOOKUP(A173,Master!A:A,Master!A:A)","v":"1805"}]
["1810","Rucksack","Ryggsäck","Backpack","Rygsæk","Rygsæk","Plecak",null,null,null,null,null,null,{"$f":"_xlfn.XLOOKUP(A174,Master!$A:$A,Master!$A:$A)","v":"1810"},null,{"$f":"_xlfn.XLOOKUP(A174,Master!A:A,Master!A:A)","v":"1810"}]
["1820","Rucksack | Canvas","Backpack | canvas","Backpack | canvas","Backpack | canvas","Backpack | canvas","Plecak | bawelna z recyklingu",null,null,null,null,null,null,{"$f":"_xlfn.XLOOKUP(A175,Master!$A:$A,Master!$A:$A)","v":"1820"},null,{"$f":"_xlfn.XLOOKUP(A175,Master!A:A,Master!A:A)","v":"1820"}]
["1821","Einkaufstasche | Canvas","Shopping bag | canvas","Shopping bag | canvas","Shopping bag | canvas","Shopping bag | canvas","Torba zakupowa | bawełna z recyklingu",null,null,null,null,null,null,{"$f":"_xlfn.XLOOKUP(A176,Master!$A:$A,Master!$A:$A)","v":"1821"},null,{"$f":"_xlfn.XLOOKUP(A176,Master!A:A,Master!A:A)","v":"1821"}]
["1825","Ripstop-Sporttasche","Ripstop sportväska","Ripstop sports bag","Ripstop sportstaske","Ripstop sportstaske","Torba sportowa Ripstop",null,null,null,null,null,null,{"$f":"_xlfn.XLOOKUP(A177,Master!$A:$A,Master!$A:$A)","v":"1825"},null,{"$f":"_xlfn.XLOOKUP(A177,Master!A:A,Master!A:A)","v":"1825"}]
["1850","Turnbeutel | Rucksack","Gymbag | ryggsäck","Gym bag | backpack","Gymbag | rygsæk","Gymbag | rygsæk","Worek sportowy | plecak",null,null,null,null,null,null,{"$f":"_xlfn.XLOOKUP(A178,Master!$A:$A,Master!$A:$A)","v":"1850"},null,{"$f":"_xlfn.XLOOKUP(A178,Master!A:A,Master!A:A)","v":"1850"}]
["1864","Computertasche","Datorväska","Computer bag","Computertaske","Computertaske","Torba na laptopa",null,null,null,null,null,null,{"$f":"_xlfn.XLOOKUP(A179,Master!$A:$A,Master!$A:$A)","v":"1864"},null,{"$f":"_xlfn.XLOOKUP(A179,Master!A:A,Master!A:A)","v":"1864"}]
["1880","Einkaufskorb","Inköpskorg","Shopping basket","Indkøbskurv","Indkøbskurv","Koszyk na zakupy",null,null,null,null,null,null,{"$f":"_xlfn.XLOOKUP(A180,Master!$A:$A,Master!$A:$A)","v":"1880"},null,{"$f":"_xlfn.XLOOKUP(A180,Master!A:A,Master!A:A)","v":"1880"}]
["1900","Arbeitsweste | EN 20471","Arbetsväst | EN 20471","Worker vest | EN 20471","Arbejdsvest | EN 20471","Arbejdsvest | EN 20471","Kamizelka robocza | EN 20471",null,null,null,null,null,null,{"$f":"_xlfn.XLOOKUP(A181,Master!$A:$A,Master!$A:$A)","v":"1900"},null,{"$f":"_xlfn.XLOOKUP(A181,Master!A:A,Master!A:A)","v":"1900"}]
["1915","Laufweste","Löparväst","Runner’s vest","Løbevest","Løbevest","Kamizelka do biegania",null,null,null,null,null,null,{"$f":"_xlfn.XLOOKUP(A182,Master!$A:$A,Master!$A:$A)","v":"1915"},null,{"$f":"_xlfn.XLOOKUP(A182,Master!A:A,Master!A:A)","v":"1915"}]
["2000","YES T-Shirt","YES T-shirt","YES T-shirt","YES T-shirt","YES T-shirt","T-shirt YES",null,null,null,null,null,null,{"$f":"_xlfn.XLOOKUP(A183,Master!$A:$A,Master!$A:$A)","v":"2000"},null,{"$f":"_xlfn.XLOOKUP(A183,Master!A:A,Master!A:A)","v":"2000"}]
["2020","YES Poloshirt","YES pikétröja","YES polo shirt","YES poloshirt","YES poloshirt","Koszulka polo YES",null,null,null,null,null,null,{"$f":"_xlfn.XLOOKUP(A184,Master!$A:$A,Master!$A:$A)","v":"2020"},null,{"$f":"_xlfn.XLOOKUP(A184,Master!A:A,Master!A:A)","v":"2020"}]
["2030","YES Active T-Shirt","YES Active T-shirt","YES Active T-shirt","YES Active T-shirt","YES Active T-shirt","T-shirt YES Active",null,null,null,null,null,null,{"$f":"_xlfn.XLOOKUP(A185,Master!$A:$A,Master!$A:$A)","v":"2030"},null,{"$f":"_xlfn.XLOOKUP(A185,Master!A:A,Master!A:A)","v":"2030"}]
["2032","YES Active T-Shirt | Damen","YES Active T-shirt | dam","YES Active T-shirt | women","YES Active T-shirt | dame","YES Active T-shirt | dame","T-shirt YES Active | damski",null,null,null,null,null,null,{"$f":"_xlfn.XLOOKUP(A186,Master!$A:$A,Master!$A:$A)","v":"2032"},null,{"$f":"_xlfn.XLOOKUP(A186,Master!A:A,Master!A:A)","v":"2032"}]
["40500","GAME® T-Shirt | Kinder","GAME® T-shirt | barn","GAME T-shirt | children","GAME® T-shirt | børn","GAME® T-shirt | børn","T-shirt GAME® | dzieci",null,null,null,null,null,null,{"$f":"_xlfn.XLOOKUP(A187,Master!$A:$A,Master!$A:$A)","v":"40500"},null,{"$f":"_xlfn.XLOOKUP(A187,Master!A:A,Master!A:A)","v":"40500"}]
["40510","T-TIME® T-Shirt | Kinder","T-TIME® T-shirt | barn","T-TIME® T-shirt | children","T-TIME® T-shirt | børn","T-TIME® T-shirt | børn","T-shirt T-TIME® | dzieci",null,null,null,null,null,null,{"$f":"_xlfn.XLOOKUP(A188,Master!$A:$A,Master!$A:$A)","v":"40510"},null,{"$f":"_xlfn.XLOOKUP(A188,Master!A:A,Master!A:A)","v":"40510"}]
["40552","T-Shirt | ökologisch | Kinder","Ekologisk T-shirt | barn","Organic T-shirt | children","Økologisk T-shirt | børn","Økologisk T-shirt | børn","T-shirt | ekologiczny | dzieci",null,null,null,null,null,null,{"$f":"_xlfn.XLOOKUP(A189,Master!$A:$A,Master!$A:$A)","v":"40552"},null,{"$f":"_xlfn.XLOOKUP(A189,Master!A:A,Master!A:A)","v":"40552"}]
["40634","CORE Sweatshirt | Kinder","CORE sweatshirt | barn","CORE sweatshirt | children","CORE sweatshirt | børn","CORE sweatshirt | børn","Bluza CORE o-neck | dzieci",null,null,null,null,null,null,{"$f":"_xlfn.XLOOKUP(A190,Master!$A:$A,Master!$A:$A)","v":"40634"},null,{"$f":"_xlfn.XLOOKUP(A190,Master!A:A,Master!A:A)","v":"40634"}]
["40636","CORE Hoodie | Kinder","CORE hoodie | barn","CORE hoodie | children","CORE hoodie | børn","CORE hoodie | børn","Bluza z kapturem CORE | dzieci",null,null,null,null,null,null,{"$f":"_xlfn.XLOOKUP(A191,Master!$A:$A,Master!$A:$A)","v":"40636"},null,{"$f":"_xlfn.XLOOKUP(A191,Master!A:A,Master!A:A)","v":"40636"}]
["40638","CORE Zip Hoodie | Kinder","CORE zip hoodie | barn","CORE zip hoodie | children","CORE zip hoodie | børn","CORE zip hoodie | børn","Rozpinana bluza z kapturem CORE | dzieci",null,null,null,null,null,null,{"$f":"_xlfn.XLOOKUP(A192,Master!$A:$A,Master!$A:$A)","v":"40638"},null,{"$f":"_xlfn.XLOOKUP(A192,Master!A:A,Master!A:A)","v":"40638"}]
["40836","Soft Shell-Jacke | leicht | Kinder","Soft shell-jacka | lättvikts | barn","Soft shell jacket | light | children","Softshell jakke | letvægts | børn","Softshell jakke | letvægt | børn","Kurtka soft shell | lekka | dzieci",null,null,null,null,null,null,{"$f":"_xlfn.XLOOKUP(A193,Master!$A:$A,Master!$A:$A)","v":"40836"},null,{"$f":"_xlfn.XLOOKUP(A193,Master!A:A,Master!A:A)","v":"40836"}]
["42030","YES Active T-Shirt | Kinder","YES Active T-shirt | barn","YES Active T-shirt | children","YES Active T-shirt | børn","YES Active T-shirt | børn","T-shirt YES Active | dzieci",null,null,null,null,null,null,{"$f":"_xlfn.XLOOKUP(A194,Master!$A:$A,Master!$A:$A)","v":"42030"},null,{"$f":"_xlfn.XLOOKUP(A194,Master!A:A,Master!A:A)","v":"42030"}]
["G11006","GEYSER polo shirt | functional | Damen","GEYSER polo shirt | functional | dam","GEYSER polo shirt | functional | women","GEYSER polo shirt | functional | dame","GEYSER polo shirt | functional | dame","Koszulka polo GEYSER | funkcjonalna | damska",null,null,null,null,null,null,{"$f":"_xlfn.XLOOKUP(A195,Master!$A:$A,Master!$A:$A)","v":"G11006"},null,{"$f":"_xlfn.XLOOKUP(A195,Master!A:A,Master!A:A)","v":"G11006"}]
["G11012","GEYSER running jacket | light | Damen","GEYSER running jacket | light | dam","GEYSER running jacket | light | women","GEYSER running jacket | light | dame","GEYSER running jacket | light | dame","Kurtka do biegania GEYSER | light | damski",null,null,null,null,null,null,{"$f":"_xlfn.XLOOKUP(A196,Master!$A:$A,Master!$A:$A)","v":{"$error":"#N/A"}},null,{"$f":"_xlfn.XLOOKUP(A196,Master!A:A,Master!A:A)","v":{"$error":"#N/A"}}]
["G11014","GEYSER running vest | light | Damen","GEYSER running vest | light | dam","GEYSER running vest | light l women","GEYSER running vest | light | dame","GEYSER running vest | light | dame","Bezrękawnik do biegania GEYSER | light | damski",null,null,null,null,null,null,{"$f":"_xlfn.XLOOKUP(A197,Master!$A:$A,Master!$A:$A)","v":{"$error":"#N/A"}},null,{"$f":"_xlfn.XLOOKUP(A197,Master!A:A,Master!A:A)","v":{"$error":"#N/A"}}]
["G11020","GEYSER T-shirt | seamless | Damen","GEYSER T-shirt | seamless | dam","GEYSER T-shirt | seamless | women","GEYSER T-shirt | seamless | dame","GEYSER T-shirt | seamless | dame","T-shirt GEYSER | bezszwowy | damski",null,null,null,null,null,null,{"$f":"_xlfn.XLOOKUP(A198,Master!$A:$A,Master!$A:$A)","v":"G11020"},null,{"$f":"_xlfn.XLOOKUP(A198,Master!A:A,Master!A:A)","v":"G11020"}]
["G11021","GEYSER long-sleeved T-shirt | seamless | Damen","GEYSER long-sleeved T-shirt | seamless | dam","GEYSER long-sleeved T-shirt | seamless | women","GEYSER l/s T-shirt | seamless | dame","GEYSER long-sleeved T-shirt | seamless | dame","Koszulka GEYSER z długim rękawem | bezszwowa | dam",null,null,null,null,null,null,{"$f":"_xlfn.XLOOKUP(A199,Master!$A:$A,Master!$A:$A)","v":"G11021"},null,{"$f":"_xlfn.XLOOKUP(A199,Master!A:A,Master!A:A)","v":"G11021"}]
["G11024","GEYSER striped T-shirt | seamless | Damen","GEYSER striped T-shirt | seamless | dam","GEYSER striped T-shirt | seamless | women","GEYSER striped T-shirt | seamless | dame","GEYSER striped T-shirt | seamless | dame","T-shirt GEYSER w paski | bezszwowy | damski",null,null,null,null,null,null,{"$f":"_xlfn.XLOOKUP(A200,Master!$A:$A,Master!$A:$A)","v":"G11024"},null,{"$f":"_xlfn.XLOOKUP(A200,Master!A:A,Master!A:A)","v":"G11024"}]
["G11032","GEYSER hybrid jacket | Damen","GEYSER hybrid jacket | dam","GEYSER hybrid jacket | women","GEYSER hybrid jacket | dame","GEYSER hybrid jacket | dame","GEYSER kurtka hybrid | damski",null,null,null,null,null,null,{"$f":"_xlfn.XLOOKUP(A201,Master!$A:$A,Master!$A:$A)","v":"G11032"},null,{"$f":"_xlfn.XLOOKUP(A201,Master!A:A,Master!A:A)","v":"G11032"}]
["G11033","GEYSER hybrid vest | Damen","GEYSER hybrid vest | dam","GEYSER hybrid vest | women","GEYSER hybrid vest | dame","GEYSER hybrid vest | dame","GEYSER bezrękawnik hybrid | damski",null,null,null,null,null,null,{"$f":"_xlfn.XLOOKUP(A202,Master!$A:$A,Master!$A:$A)","v":"G11033"},null,{"$f":"_xlfn.XLOOKUP(A202,Master!A:A,Master!A:A)","v":"G11033"}]
["G11036","GEYSER Active pants | stretch | Damen","GEYSER active pants | stretch | dam","GEYSER active pants | stretch | women","GEYSER active pants | stretch | dame","GEYSER active pants | stretch | dame","Spodnie GEYSER | stretch | damskie",null,null,null,null,null,null,{"$f":"_xlfn.XLOOKUP(A203,Master!$A:$A,Master!$A:$A)","v":"G11036"},null,{"$f":"_xlfn.XLOOKUP(A203,Master!A:A,Master!A:A)","v":"G11036"}]
["G11040","GEYSER T-shirt | essential | Damen","GEYSER T-shirt I essential | dam","GEYSER T-shirt | essential | women","GEYSER T-shirt I essential | dame","GEYSER T-shirt | essential | dame","T-shirt GEYSER I essential | damski",null,null,null,null,null,null,{"$f":"_xlfn.XLOOKUP(A204,Master!$A:$A,Master!$A:$A)","v":"G11040"},null,{"$f":"_xlfn.XLOOKUP(A204,Master!A:A,Master!A:A)","v":"G11040"}]
["G11048","GEYSER performance tights | long | Damen","GEYSER performance tights | long | dam","GEYSER performance tights | long | women","GEYSER performance tights | long | dame","GEYSER performance tights | long | dame","Legginsy GEYSER | długie | damskie",null,null,null,null,null,null,{"$f":"_xlfn.XLOOKUP(A205,Master!$A:$A,Master!$A:$A)","v":"G11048"},null,{"$f":"_xlfn.XLOOKUP(A205,Master!A:A,Master!A:A)","v":"G11048"}]
["G11049","GEYSER performance tights | short | Damen","GEYSER performance tights | short | dam","GEYSER performance tights | short | women","GEYSER performance tights | short | dame","GEYSER performance tights | short | dame","Legginsy GEYSER | krótkie | damskie",null,null,null,null,null,null,{"$f":"_xlfn.XLOOKUP(A206,Master!$A:$A,Master!$A:$A)","v":"G11049"},null,{"$f":"_xlfn.XLOOKUP(A206,Master!A:A,Master!A:A)","v":"G11049"}]
["G11070","GEYSER winter jacket | Damen","GEYSER winter jacket | dam","GEYSER winter jacket | women","GEYSER winter jacket | dame","GEYSER winter jacket | dame","Zimowa kurtka GEYSER | damski",null,null,null,null,null,null,{"$f":"_xlfn.XLOOKUP(A207,Master!$A:$A,Master!$A:$A)","v":"G11070"},null,{"$f":"_xlfn.XLOOKUP(A207,Master!A:A,Master!A:A)","v":"G11070"}]
["G11080","GEYSER stretch hoodie | Damen","GEYSER stretch hoodie | dam","GEYSER stretch hoodie | women","GEYSER stretch hoodie | dame","GEYSER stretch hoodie | dame","GEYSER bluza stretch | damski",null,null,null,null,null,null,{"$f":"_xlfn.XLOOKUP(A208,Master!$A:$A,Master!$A:$A)","v":"G11080"},null,{"$f":"_xlfn.XLOOKUP(A208,Master!A:A,Master!A:A)","v":"G11080"}]
["G11090","GEYSER stretch trainer | ¼ zip | Damen","GEYSER stretch trainer | ¼ zip | dam","GEYSER stretch trainer | ¼ zip | women","GEYSER stretch trainer | ¼ zip | dame","GEYSER stretch trainer | ¼ zip | dame","GEYSER bluza treningowa stretch | ¼ zip | damski",null,null,null,null,null,null,{"$f":"_xlfn.XLOOKUP(A209,Master!$A:$A,Master!$A:$A)","v":"G11090"},null,{"$f":"_xlfn.XLOOKUP(A209,Master!A:A,Master!A:A)","v":"G11090"}]
["G21006","GEYSER polo shirt | functional","GEYSER polo shirt | functional","GEYSER polo shirt | functional","GEYSER polo shirt | functional","GEYSER polo shirt | functional","Koszulka polo GEYSER | funkcjonalna",null,null,null,null,null,null,{"$f":"_xlfn.XLOOKUP(A210,Master!$A:$A,Master!$A:$A)","v":"G21006"},null,{"$f":"_xlfn.XLOOKUP(A210,Master!A:A,Master!A:A)","v":"G21006"}]
["G21012","GEYSER running jacket | light","GEYSER running jacket | light","GEYSER running jacket | light","GEYSER running jacket | light","GEYSER running jacket | light","Kurtka do biegania GEYSER | light",null,null,null,null,null,null,{"$f":"_xlfn.XLOOKUP(A211,Master!$A:$A,Master!$A:$A)","v":{"$error":"#N/A"}},null,{"$f":"_xlfn.XLOOKUP(A211,Master!A:A,Master!A:A)","v":{"$error":"#N/A"}}]
["G21014","GEYSER running vest | light","GEYSER running vest | light","GEYSER running vest | light","GEYSER running vest | light","GEYSER running vest | light","Bezrękawnik do biegania GEYSER | light",null,null,null,null,null,null,{"$f":"_xlfn.XLOOKUP(A212,Master!$A:$A,Master!$A:$A)","v":{"$error":"#N/A"}},null,{"$f":"_xlfn.XLOOKUP(A212,Master!A:A,Master!A:A)","v":{"$error":"#N/A"}}]
["G21015","GEYSER sporty training pants","GEYSER sporty training pants","GEYSER sporty training pants","GEYSER sporty training pants","GEYSER sporty training pants","Spodnie treningowe GEYSER",null,null,null,null,null,null,{"$f":"_xlfn.XLOOKUP(A213,Master!$A:$A,Master!$A:$A)","v":"G21015"},null,{"$f":"_xlfn.XLOOKUP(A213,Master!A:A,Master!A:A)","v":"G21015"}]
["G21020","GEYSER T-shirt | seamless","GEYSER T-shirt | seamless","GEYSER T-shirt | seamless","GEYSER T-shirt | seamless","GEYSER T-shirt | seamless","T-shirt GEYSER | bezszwowy",null,null,null,null,null,null,{"$f":"_xlfn.XLOOKUP(A214,Master!$A:$A,Master!$A:$A)","v":"G21020"},null,{"$f":"_xlfn.XLOOKUP(A214,Master!A:A,Master!A:A)","v":"G21020"}]
["G21021","GEYSER long-sleeved T-shirt | seamless","GEYSER long-sleeved T-shirt | seamless","GEYSER long-sleeved T-shirt | seamless","GEYSER l/s T-shirt | seamless","GEYSER long-sleeved T-shirt | seamless","Koszulka GEYSER z długim rękawem | bezszwowa",null,null,null,null,null,null,{"$f":"_xlfn.XLOOKUP(A215,Master!$A:$A,Master!$A:$A)","v":"G21021"},null,{"$f":"_xlfn.XLOOKUP(A215,Master!A:A,Master!A:A)","v":"G21021"}]
["G21024","GEYSER striped T-shirt | seamless","GEYSER striped T-shirt | seamless","GEYSER striped T-shirt | seamless","GEYSER striped T-shirt | seamless","GEYSER striped T-shirt | seamless","T-shirt GEYSER w paski | bezszwowy",null,null,null,null,null,null,{"$f":"_xlfn.XLOOKUP(A216,Master!$A:$A,Master!$A:$A)","v":"G21024"},null,{"$f":"_xlfn.XLOOKUP(A216,Master!A:A,Master!A:A)","v":"G21024"}]
["G21032","GEYSER hybrid jacket","GEYSER hybrid jacket","GEYSER hybrid jacket","GEYSER hybrid jacket","GEYSER hybrid jacket","GEYSER kurtka hybrid",null,null,null,null,null,null,{"$f":"_xlfn.XLOOKUP(A217,Master!$A:$A,Master!$A:$A)","v":"G21032"},null,{"$f":"_xlfn.XLOOKUP(A217,Master!A:A,Master!A:A)","v":"G21032"}]
["G21033","GEYSER hybrid vest","GEYSER hybrid vest","GEYSER hybrid vest","GEYSER hybrid vest","GEYSER hybrid vest","GEYSER bezrękawnik hybrid",null,null,null,null,null,null,{"$f":"_xlfn.XLOOKUP(A218,Master!$A:$A,Master!$A:$A)","v":"G21033"},null,{"$f":"_xlfn.XLOOKUP(A218,Master!A:A,Master!A:A)","v":"G21033"}]
["G21034","GEYSER Active shorts | stretch","GEYSER active shorts | stretch","GEYSER active shorts | stretch","GEYSER Active shorts | stretch","GEYSER active shorts | stretch","Spodenki GEYSER | stretch",null,null,null,null,null,null,{"$f":"_xlfn.XLOOKUP(A219,Master!$A:$A,Master!$A:$A)","v":"G21034"},null,{"$f":"_xlfn.XLOOKUP(A219,Master!A:A,Master!A:A)","v":"G21034"}]
["G21036","GEYSER Active pants | stretch","GEYSER active pants | stretch","GEYSER active pants | stretch","GEYSER active pants | stretch","GEYSER active pants | stretch","Spodnie GEYSER | stretch",null,null,null,null,null,null,{"$f":"_xlfn.XLOOKUP(A220,Master!$A:$A,Master!$A:$A)","v":"G21036"},null,{"$f":"_xlfn.XLOOKUP(A220,Master!A:A,Master!A:A)","v":"G21036"}]
["G21040","GEYSER T-Shirt | essential","GEYSER T-shirt I essential","GEYSER T-shirt | essential","GEYSER T-shirt I essential","GEYSER T-shirt | essential","T-shirt GEYSER I essential",null,null,null,null,null,null,{"$f":"_xlfn.XLOOKUP(A221,Master!$A:$A,Master!$A:$A)","v":"G21040"},null,{"$f":"_xlfn.XLOOKUP(A221,Master!A:A,Master!A:A)","v":"G21040"}]
["G21048","GEYSER performance tights | long","GEYSER performance tights | long","GEYSER performance tights | long","GEYSER performance tights | long","GEYSER performance tights | long","Legginsy GEYSER | długie",null,null,null,null,null,null,{"$f":"_xlfn.XLOOKUP(A222,Master!$A:$A,Master!$A:$A)","v":"G21048"},null,{"$f":"_xlfn.XLOOKUP(A222,Master!A:A,Master!A:A)","v":"G21048"}]
["G21049","GEYSER performance tights | short","GEYSER performance tights | short","GEYSER performance tights | short","GEYSER performance tights | short","GEYSER performance tights | short","Legginsy GEYSER | krótkie",null,null,null,null,null,null,{"$f":"_xlfn.XLOOKUP(A223,Master!$A:$A,Master!$A:$A)","v":"G21049"},null,{"$f":"_xlfn.XLOOKUP(A223,Master!A:A,Master!A:A)","v":"G21049"}]
["G21070","GEYSER winter jacket","GEYSER winter jacket","GEYSER winter jacket","GEYSER winter jacket","GEYSER winter jacket","Zimowa kurtka GEYSER",null,null,null,null,null,null,{"$f":"_xlfn.XLOOKUP(A224,Master!$A:$A,Master!$A:$A)","v":"G21070"},null,{"$f":"_xlfn.XLOOKUP(A224,Master!A:A,Master!A:A)","v":"G21070"}]
["G21080","GEYSER stretch hoodie","GEYSER stretch hoodie","GEYSER stretch hoodie","GEYSER stretch hoodie","GEYSER stretch hoodie","GEYSER bluza stretch",null,null,null,null,null,null,{"$f":"_xlfn.XLOOKUP(A225,Master!$A:$A,Master!$A:$A)","v":"G21080"},null,{"$f":"_xlfn.XLOOKUP(A225,Master!A:A,Master!A:A)","v":"G21080"}]
["G21090","GEYSER stretch trainer | ¼ zip","GEYSER stretch trainer | ¼ zip","GEYSER stretch trainer | ¼ zip","GEYSER stretch trainer | ¼ zip","GEYSER stretch trainer | ¼ zip","GEYSER bluza treningowa stretch | ¼ zip",null,null,null,null,null,null,{"$f":"_xlfn.XLOOKUP(A226,Master!$A:$A,Master!$A:$A)","v":"G21090"},null,{"$f":"_xlfn.XLOOKUP(A226,Master!A:A,Master!A:A)","v":"G21090"}]
["G50000","GEYSER stretch running socks","GEYSER stretch running socks","GEYSER stretch running socks","GEYSER stretch running socks","GEYSER stretch running socks","GEYSER skarpety do biegania stretch",null,null,null,null,null,null,{"$f":"_xlfn.XLOOKUP(A227,Master!$A:$A,Master!$A:$A)","v":"G50000"},null,{"$f":"_xlfn.XLOOKUP(A227,Master!A:A,Master!A:A)","v":"G50000"}]
["G60010","GEYSER backpack","GEYSER backpack","GEYSER backpack","GEYSER backpack","GEYSER backpack","GEYSER backpack",null,null,null,null,null,null,{"$f":"_xlfn.XLOOKUP(A228,Master!$A:$A,Master!$A:$A)","v":"G60010"},null,{"$f":"_xlfn.XLOOKUP(A228,Master!A:A,Master!A:A)","v":"G60010"}]
["M00111","Bügeln","Galge","Hanger","Bøjler ID","Bøjler ID","Bøjler ID",null,null,null,null,null,null,{"$f":"_xlfn.XLOOKUP(A229,Master!$A:$A,Master!$A:$A)","v":{"$error":"#N/A"}},null,{"$f":"_xlfn.XLOOKUP(A229,Master!A:A,Master!A:A)","v":{"$error":"#N/A"}}]
["M00112","SOS Bügeln","SOS Galge","SOS Hanger","Seven Seas bøjle","Seven Seas bøjle","Seven Seas bøjle",null,null,null,null,null,null,{"$f":"_xlfn.XLOOKUP(A230,Master!$A:$A,Master!$A:$A)","v":{"$error":"#N/A"}},null,{"$f":"_xlfn.XLOOKUP(A230,Master!A:A,Master!A:A)","v":{"$error":"#N/A"}}]
["M00155","Non Woven pose ID","Non Woven pose ID","Non Woven pose ID","Non Woven pose ID","Non Woven pose ID","Non Woven pose ID",null,null,null,null,null,null,{"$f":"_xlfn.XLOOKUP(A231,Master!$A:$A,Master!$A:$A)","v":{"$error":"#N/A"}},null,{"$f":"_xlfn.XLOOKUP(A231,Master!A:A,Master!A:A)","v":{"$error":"#N/A"}}]
["S370","SEVEN SEAS Fine Twill Contrast | modern","SEVEN SEAS Fine Twill Contrast | modern","SEVEN SEAS Fine Twill Contrast | modern","SEVEN SEAS Fine Twill Contrast | modern","SEVEN SEAS Fine Twill Contrast | modern","SEVEN SEAS Fine Twill Contrast | modern",null,null,null,null,null,null,{"$f":"_xlfn.XLOOKUP(A232,Master!$A:$A,Master!$A:$A)","v":"S370"},null,{"$f":"_xlfn.XLOOKUP(A232,Master!A:A,Master!A:A)","v":"S370"}]
["S371","SEVEN SEAS Fine Twill Contrast | slim","SEVEN SEAS Fine Twill Contrast | slim","SEVEN SEAS Fine Twill Contrast | slim","SEVEN SEAS Fine Twill Contrast | slim","SEVEN SEAS Fine Twill Contrast | slim","SEVEN SEAS Fine Twill Contrast | slim",null,null,null,null,null,null,{"$f":"_xlfn.XLOOKUP(A233,Master!$A:$A,Master!$A:$A)","v":"S371"},null,{"$f":"_xlfn.XLOOKUP(A233,Master!A:A,Master!A:A)","v":"S371"}]
["S372","SEVEN SEAS Fine Twill Contrast | modern | Damen","SEVEN SEAS Fine Twill Contrast | modern | dam","SEVEN SEAS Fine Twill Contrast | modern | women","SEVEN SEAS Fine Twill Contrast | modern | dame","SEVEN SEAS Fine Twill Contrast | modern | dame","SEVEN SEAS Fine Twill Contrast | modern | damski",null,null,null,null,null,null,{"$f":"_xlfn.XLOOKUP(A234,Master!$A:$A,Master!$A:$A)","v":"S372"},null,{"$f":"_xlfn.XLOOKUP(A234,Master!A:A,Master!A:A)","v":"S372"}]
["S50","SEVEN SEAS Hybrid shirt | modern","SEVEN SEAS Hybrid shirt | modern","SEVEN SEAS Hybrid shirt | modern","SEVEN SEAS Hybrid shirt | modern","SEVEN SEAS Hybrid shirt | modern","SEVEN SEAS Hybrid shirt | modern",null,null,null,null,null,null,{"$f":"_xlfn.XLOOKUP(A235,Master!$A:$A,Master!$A:$A)","v":"S50"},null,{"$f":"_xlfn.XLOOKUP(A235,Master!A:A,Master!A:A)","v":"S50"}]
["S51","SEVEN SEAS Hybrid shirt | slim","SEVEN SEAS Hybrid shirt | slim","SEVEN SEAS Hybrid shirt | slim","SEVEN SEAS Hybrid shirt | slim","SEVEN SEAS Hybrid shirt | slim","SEVEN SEAS Hybrid shirt | slim",null,null,null,null,null,null,{"$f":"_xlfn.XLOOKUP(A236,Master!$A:$A,Master!$A:$A)","v":"S51"},null,{"$f":"_xlfn.XLOOKUP(A236,Master!A:A,Master!A:A)","v":"S51"}]
["S52","SEVEN SEAS Hybrid shirt | modern | Damen","SEVEN SEAS Hybrid shirt | modern | dam","SEVEN SEAS Hybrid shirt | modern | women","SEVEN SEAS Hybrid shirt | modern | dame","SEVEN SEAS Hybrid shirt | modern | dame","SEVEN SEAS Hybrid shirt | modern | damska",null,null,null,null,null,null,{"$f":"_xlfn.XLOOKUP(A237,Master!$A:$A,Master!$A:$A)","v":"S52"},null,{"$f":"_xlfn.XLOOKUP(A237,Master!A:A,Master!A:A)","v":"S52"}]
["S60","SEVEN SEAS Oxford | modern","SEVEN SEAS Oxford | modern","SEVEN SEAS Oxford | modern","SEVEN SEAS Oxford | modern","SEVEN SEAS Oxford | modern","SEVEN SEAS Oxford | modern",null,null,null,null,null,null,{"$f":"_xlfn.XLOOKUP(A238,Master!$A:$A,Master!$A:$A)","v":"S60"},null,{"$f":"_xlfn.XLOOKUP(A238,Master!A:A,Master!A:A)","v":"S60"}]
["S600","SEVEN SEAS The polo","SEVEN SEAS polo shirt","SEVEN SEAS The polo","SEVEN SEAS The polo","SEVEN SEAS The polo","SEVEN SEAS The polo",null,null,null,null,null,null,{"$f":"_xlfn.XLOOKUP(A239,Master!$A:$A,Master!$A:$A)","v":"S600"},null,{"$f":"_xlfn.XLOOKUP(A239,Master!A:A,Master!A:A)","v":"S600"}]
["S61","SEVEN SEAS Oxford | slim","SEVEN SEAS Oxford | slim","SEVEN SEAS Oxford | slim","SEVEN SEAS Oxford | slim","SEVEN SEAS Oxford | slim","SEVEN SEAS Oxford | slim fit",null,null,null,null,null,null,{"$f":"_xlfn.XLOOKUP(A240,Master!$A:$A,Master!$A:$A)","v":"S61"},null,{"$f":"_xlfn.XLOOKUP(A240,Master!A:A,Master!A:A)","v":"S61"}]
["S610","SEVEN SEAS The polo | Damen","SEVEN SEAS polo shirt | dam","SEVEN SEAS The polo | women","SEVEN SEAS The polo | dame","SEVEN SEAS The polo | dame","SEVEN SEAS The polo | damska",null,null,null,null,null,null,{"$f":"_xlfn.XLOOKUP(A241,Master!$A:$A,Master!$A:$A)","v":"S610"},null,{"$f":"_xlfn.XLOOKUP(A241,Master!A:A,Master!A:A)","v":"S610"}]
["S62","SEVEN SEAS Oxford | modern | Damen","SEVEN SEAS Oxford | modern | dam","SEVEN SEAS Oxford | modern | women","SEVEN SEAS Oxford | modern | dame","SEVEN SEAS Oxford | modern | dame","SEVEN SEAS Oxford | modern | damski",null,null,null,null,null,null,{"$f":"_xlfn.XLOOKUP(A242,Master!$A:$A,Master!$A:$A)","v":"S62"},null,{"$f":"_xlfn.XLOOKUP(A242,Master!A:A,Master!A:A)","v":"S62"}]
["S620","SEVEN SEAS T-shirt | o-neck","SEVEN SEAS T-shirt | o-neck","SEVEN SEAS T-shirt | o-neck","SEVEN SEAS T-shirt | o-neck","SEVEN SEAS T-shirt | o-neck","SEVEN SEAS T-shirt | o-neck",null,null,null,null,null,null,{"$f":"_xlfn.XLOOKUP(A243,Master!$A:$A,Master!$A:$A)","v":"S620"},null,{"$f":"_xlfn.XLOOKUP(A243,Master!A:A,Master!A:A)","v":"S620"}]
["S63","SEVEN SEAS Oxford | long | modern | Damen","SEVEN SEAS Oxford | lang | modern | dam","SEVEN SEAS Oxford | long | modern | women","SEVEN SEAS Oxford | long | modern | dame","SEVEN SEAS Oxford | lang | modern | dame","SEVEN SEAS Oxford | long | modern | damski",null,null,null,null,null,null,{"$f":"_xlfn.XLOOKUP(A244,Master!$A:$A,Master!$A:$A)","v":"S63"},null,{"$f":"_xlfn.XLOOKUP(A244,Master!A:A,Master!A:A)","v":"S63"}]
["S630","SEVEN SEAS T-shirt | o-neck | Damen","SEVEN SEAS T-shirt | o-neck | dam","SEVEN SEAS T-shirt | o-neck | women","SEVEN SEAS T-shirt | o-neck | dame","SEVEN SEAS T-shirt | o-neck | dame","SEVEN SEAS T-shirt | o-neck | damski",null,null,null,null,null,null,{"$f":"_xlfn.XLOOKUP(A245,Master!$A:$A,Master!$A:$A)","v":"S630"},null,{"$f":"_xlfn.XLOOKUP(A245,Master!A:A,Master!A:A)","v":"S630"}]
["S640","SEVEN SEAS The knit | o-neck | Damen","SEVEN SEAS The knit | o-neck | dam","SEVEN SEAS The knit | o-neck | women","SEVEN SEAS The knit | o-neck | dame","SEVEN SEAS The knit | o-neck | dame","SEVEN SEAS The knit | o-neck | damski",null,null,null,null,null,null,{"$f":"_xlfn.XLOOKUP(A246,Master!$A:$A,Master!$A:$A)","v":"S640"},null,{"$f":"_xlfn.XLOOKUP(A246,Master!A:A,Master!A:A)","v":"S640"}]
["S650","SEVEN SEAS The knit | o-neck","SEVEN SEAS The knit | o-neck","SEVEN SEAS The knit | o-neck","SEVEN SEAS The knit | o-neck","SEVEN SEAS The knit | o-neck","SEVEN SEAS The knit | o-neck",null,null,null,null,null,null,{"$f":"_xlfn.XLOOKUP(A247,Master!$A:$A,Master!$A:$A)","v":"S650"},null,{"$f":"_xlfn.XLOOKUP(A247,Master!A:A,Master!A:A)","v":"S650"}]
["S660","SEVEN SEAS The cardigan","SEVEN SEAS The cardigan","SEVEN SEAS The cardigan","SEVEN SEAS The cardigan","SEVEN SEAS The cardigan","SEVEN SEAS The cardigan",null,null,null,null,null,null,{"$f":"_xlfn.XLOOKUP(A248,Master!$A:$A,Master!$A:$A)","v":"S660"},null,{"$f":"_xlfn.XLOOKUP(A248,Master!A:A,Master!A:A)","v":"S660"}]
["S661","SEVEN SEAS The cardigan | Damen","SEVEN SEAS The cardigan | dam","SEVEN SEAS The cardigan | women","SEVEN SEAS The cardigan | dame","SEVEN SEAS The cardigan | dame","SEVEN SEAS The cardigan | damski",null,null,null,null,null,null,{"$f":"_xlfn.XLOOKUP(A249,Master!$A:$A,Master!$A:$A)","v":"S661"},null,{"$f":"_xlfn.XLOOKUP(A249,Master!A:A,Master!A:A)","v":"S661"}]
["S670","SEVEN SEAS The knit | v-neck","SEVEN SEAS The knit | v-neck","SEVEN SEAS The knit | v-neck","SEVEN SEAS The knit | v-neck","SEVEN SEAS The knit | v-neck","SEVEN SEAS The knit | v-neck",null,null,null,null,null,null,{"$f":"_xlfn.XLOOKUP(A250,Master!$A:$A,Master!$A:$A)","v":"S670"},null,{"$f":"_xlfn.XLOOKUP(A250,Master!A:A,Master!A:A)","v":"S670"}]
["S671","SEVEN SEAS The knit | v-neck | Damen","SEVEN SEAS The knit | v-neck | dam","SEVEN SEAS The knit | v-neck | women","SEVEN SEAS The knit | v-neck | dame","SEVEN SEAS The knit | v-neck | dame","SEVEN SEAS The knit | v-neck | damski",null,null,null,null,null,null,{"$f":"_xlfn.XLOOKUP(A251,Master!$A:$A,Master!$A:$A)","v":"S671"},null,{"$f":"_xlfn.XLOOKUP(A251,Master!A:A,Master!A:A)","v":"S671"}]
["S70","SEVEN SEAS Fine Twill Cadet | modern","SEVEN SEAS Fine Twill Cadet | modern","SEVEN SEAS Fine Twill Cadet | modern","SEVEN SEAS Fine Twill Cadet | modern","SEVEN SEAS Fine Twill Cadet | modern","SEVEN SEAS Fine Twill Cadet | modern",null,null,null,null,null,null,{"$f":"_xlfn.XLOOKUP(A252,Master!$A:$A,Master!$A:$A)","v":"S70"},null,{"$f":"_xlfn.XLOOKUP(A252,Master!A:A,Master!A:A)","v":"S70"}]
["S721","SEVEN SEAS Fine Twill | modern | s/s | Damen","SEVEN SEAS Fine Twill | modern | s/s |dam","SEVEN SEAS Fine Twill | modern | s/s | women","SEVEN SEAS Fine Twill | modern | s/s | dame","SEVEN SEAS Fine Twill | modern | s/s | dame","SEVEN SEAS Fine Twill | modern | s/s | damski",null,null,null,null,null,null,{"$f":"_xlfn.XLOOKUP(A253,Master!$A:$A,Master!$A:$A)","v":"S721"},null,{"$f":"_xlfn.XLOOKUP(A253,Master!A:A,Master!A:A)","v":"S721"}]
["S780","SEVEN SEAS Fine Twill Cadet | modern | Damen","SEVEN SEAS Fine Twill Cadet | modern | dam","SEVEN SEAS Fine Twill Cadet | modern | women","SEVEN SEAS Fine Twill Cadet | modern | dame","SEVEN SEAS Fine Twill Cadet | modern | dame","SEVEN SEAS Fine Twill Cadet | modern | damski",null,null,null,null,null,null,{"$f":"_xlfn.XLOOKUP(A254,Master!$A:$A,Master!$A:$A)","v":"S780"},null,{"$f":"_xlfn.XLOOKUP(A254,Master!A:A,Master!A:A)","v":"S780"}]
["S84","SEVEN SEAS The Jersey | modern","SEVEN SEAS The Jersey | modern","SEVEN SEAS The Jersey | modern","SEVEN SEAS The Jersey | modern","SEVEN SEAS The Jersey | modern","SEVEN SEAS The Jersey | modern",null,null,null,null,null,null,{"$f":"_xlfn.XLOOKUP(A255,Master!$A:$A,Master!$A:$A)","v":"S84"},null,{"$f":"_xlfn.XLOOKUP(A255,Master!A:A,Master!A:A)","v":"S84"}]
["S85","SEVEN SEAS The Jersey | modern | Damen","SEVEN SEAS The Jersey | modern | dam","SEVEN SEAS The Jersey | modern | women","SEVEN SEAS The Jersey | modern | dame","SEVEN SEAS The Jersey | modern | dame","SEVEN SEAS The Jersey | modern | damski",null,null,null,null,null,null,{"$f":"_xlfn.XLOOKUP(A256,Master!$A:$A,Master!$A:$A)","v":"S85"},null,{"$f":"_xlfn.XLOOKUP(A256,Master!A:A,Master!A:A)","v":"S85"}]
["S86","SEVEN SEAS The Jersey | slim","SEVEN SEAS The Jersey | slim","SEVEN SEAS The Jersey | slim","SEVEN SEAS The Jersey | slim","SEVEN SEAS The Jersey | slim","SEVEN SEAS The Jersey | slim",null,null,null,null,null,null,{"$f":"_xlfn.XLOOKUP(A257,Master!$A:$A,Master!$A:$A)","v":"S86"},null,{"$f":"_xlfn.XLOOKUP(A257,Master!A:A,Master!A:A)","v":"S86"}]
["S90","SEVEN SEAS Fine Twill Cadet | slim","SEVEN SEAS Fine Twill Cadet | slim","SEVEN SEAS Fine Twill Cadet | slim","SEVEN SEAS Fine Twill Cadet | slim","SEVEN SEAS Fine Twill Cadet | slim","SEVEN SEAS Fine Twill Cadet | slim",null,null,null,null,null,null,{"$f":"_xlfn.XLOOKUP(A258,Master!$A:$A,Master!$A:$A)","v":"S90"},null,{"$f":"_xlfn.XLOOKUP(A258,Master!A:A,Master!A:A)","v":"S90"}]
["SS20","SEVEN SEAS Fine Twill California | modern","SEVEN SEAS Fine Twill California | modern","SEVEN SEAS Fine Twill California | modern","SEVEN SEAS Fine Twill California | modern","SEVEN SEAS Fine Twill California | modern","SEVEN SEAS Fine Twill California | modern",null,null,null,null,null,null,{"$f":"_xlfn.XLOOKUP(A259,Master!$A:$A,Master!$A:$A)","v":"SS20"},null,{"$f":"_xlfn.XLOOKUP(A259,Master!A:A,Master!A:A)","v":"SS20"}]
["SS254","SEVEN SEAS Fine Twill | modern | s/s","SEVEN SEAS Fine Twill | modern | s/s","SEVEN SEAS Fine Twill | modern | s/s","SEVEN SEAS Fine Twill | modern | s/s","SEVEN SEAS Fine Twill | modern | s/s","SEVEN SEAS Fine Twill | modern | s/s",null,null,null,null,null,null,{"$f":"_xlfn.XLOOKUP(A260,Master!$A:$A,Master!$A:$A)","v":"SS254"},null,{"$f":"_xlfn.XLOOKUP(A260,Master!A:A,Master!A:A)","v":"SS254"}]
["SS30","SEVEN SEAS Fine Twill | slim","SEVEN SEAS Fine Twill | slim","SEVEN SEAS Fine Twill | slim","SEVEN SEAS Fine Twill | slim","SEVEN SEAS Fine Twill | slim","SEVEN SEAS Fine Twill | slim",null,null,null,null,null,null,{"$f":"_xlfn.XLOOKUP(A261,Master!$A:$A,Master!$A:$A)","v":"SS30"},null,{"$f":"_xlfn.XLOOKUP(A261,Master!A:A,Master!A:A)","v":"SS30"}]
["SS310","SEVEN SEAS Royal Oxford | modern","SEVEN SEAS Royal Oxford | modern","SEVEN SEAS Royal Oxford | modern","SEVEN SEAS Royal Oxford | modern","SEVEN SEAS Royal Oxford | modern","SEVEN SEAS Royal Oxford | modern",null,null,null,null,null,null,{"$f":"_xlfn.XLOOKUP(A262,Master!$A:$A,Master!$A:$A)","v":"SS310"},null,{"$f":"_xlfn.XLOOKUP(A262,Master!A:A,Master!A:A)","v":"SS310"}]
["SS311","SEVEN SEAS Royal Oxford | slim","SEVEN SEAS Royal Oxford | slim","SEVEN SEAS Royal Oxford | slim","SEVEN SEAS Royal Oxford | slim","SEVEN SEAS Royal Oxford | slim","SEVEN SEAS Royal Oxford | slim",null,null,null,null,null,null,{"$f":"_xlfn.XLOOKUP(A263,Master!$A:$A,Master!$A:$A)","v":"SS311"},null,{"$f":"_xlfn.XLOOKUP(A263,Master!A:A,Master!A:A)","v":"SS311"}]
["SS37","SEVEN SEAS Fine Twill California | slim","SEVEN SEAS Fine Twill California | slim","SEVEN SEAS Fine Twill California | slim","SEVEN SEAS Fine Twill California | slim","SEVEN SEAS Fine Twill California | slim","SEVEN SEAS Fine Twill California | slim",null,null,null,null,null,null,{"$f":"_xlfn.XLOOKUP(A264,Master!$A:$A,Master!$A:$A)","v":"SS37"},null,{"$f":"_xlfn.XLOOKUP(A264,Master!A:A,Master!A:A)","v":"SS37"}]
["SS402","SEVEN SEAS Poplin | slim","SEVEN SEAS Poplin | slim","SEVEN SEAS Poplin | slim","SEVEN SEAS Poplin | slim","SEVEN SEAS Poplin | slim","SEVEN SEAS Poplin | slim",null,null,null,null,null,null,{"$f":"_xlfn.XLOOKUP(A265,Master!$A:$A,Master!$A:$A)","v":"SS402"},null,{"$f":"_xlfn.XLOOKUP(A265,Master!A:A,Master!A:A)","v":"SS402"}]
["SS410","SEVEN SEAS Poplin | modern | s/s","SEVEN SEAS Poplin | modern | s/s","SEVEN SEAS Poplin | modern | s/s","SEVEN SEAS Poplin | modern | s/s","SEVEN SEAS Poplin | modern | s/s","SEVEN SEAS Poplin | modern | s/s",null,null,null,null,null,null,{"$f":"_xlfn.XLOOKUP(A266,Master!$A:$A,Master!$A:$A)","v":"SS410"},null,{"$f":"_xlfn.XLOOKUP(A266,Master!A:A,Master!A:A)","v":"SS410"}]
["SS500","SEVEN SEAS Soft Denim | modern","SEVEN SEAS Soft Denim | modern","SEVEN SEAS Soft Denim | modern","SEVEN SEAS Soft Denim | modern","SEVEN SEAS Soft Denim | modern","SEVEN SEAS Soft Denim | modern",null,null,null,null,null,null,{"$f":"_xlfn.XLOOKUP(A267,Master!$A:$A,Master!$A:$A)","v":"SS500"},null,{"$f":"_xlfn.XLOOKUP(A267,Master!A:A,Master!A:A)","v":"SS500"}]
["SS7","SEVEN SEAS Poplin | modern","SEVEN SEAS Poplin | modern","SEVEN SEAS Poplin | modern","SEVEN SEAS Poplin | modern","SEVEN SEAS Poplin | modern","SEVEN SEAS Poplin | modern",null,null,null,null,null,null,{"$f":"_xlfn.XLOOKUP(A268,Master!$A:$A,Master!$A:$A)","v":"SS7"},null,{"$f":"_xlfn.XLOOKUP(A268,Master!A:A,Master!A:A)","v":"SS7"}]
["SS710","SEVEN SEAS Poplin | modern | Damen","SEVEN SEAS Poplin | modern | dam","SEVEN SEAS Poplin | modern | women","SEVEN SEAS Poplin | modern | dame","SEVEN SEAS Poplin | modern | dame","SEVEN SEAS Poplin | modern | damski",null,null,null,null,null,null,{"$f":"_xlfn.XLOOKUP(A269,Master!$A:$A,Master!$A:$A)","v":"SS710"},null,{"$f":"_xlfn.XLOOKUP(A269,Master!A:A,Master!A:A)","v":"SS710"}]
["SS720","SEVEN SEAS Fine Twill | modern | Damen","SEVEN SEAS Fine Twill | modern | dam","SEVEN SEAS Fine Twill | modern | women","SEVEN SEAS Fine Twill | modern | dame","SEVEN SEAS Fine Twill | modern | dame","SEVEN SEAS Fine Twill | modern | damski",null,null,null,null,null,null,{"$f":"_xlfn.XLOOKUP(A270,Master!$A:$A,Master!$A:$A)","v":"SS720"},null,{"$f":"_xlfn.XLOOKUP(A270,Master!A:A,Master!A:A)","v":"SS720"}]
["SS730","SEVEN SEAS Fine Twill California | modern | Damen","SEVEN SEAS Fine Twill California | modern | dam","SEVEN SEAS Fine Twill California | modern | women","SEVEN SEAS Fine Twill California | modern | dame","SEVEN SEAS Fine Twill California | modern | dame","SEVEN SEAS Fine Twill California | modern | damski",null,null,null,null,null,null,{"$f":"_xlfn.XLOOKUP(A271,Master!$A:$A,Master!$A:$A)","v":"SS730"},null,{"$f":"_xlfn.XLOOKUP(A271,Master!A:A,Master!A:A)","v":"SS730"}]
["SS740","SEVEN SEAS Royal Oxford | modern | Damen","SEVEN SEAS Royal Oxford | modern | dam","SEVEN SEAS Royal Oxford | modern | women","SEVEN SEAS Royal Oxford | modern | dame","SEVEN SEAS Royal Oxford | modern | dame","SEVEN SEAS Royal Oxford | modern | damski",null,null,null,null,null,null,{"$f":"_xlfn.XLOOKUP(A272,Master!$A:$A,Master!$A:$A)","v":"SS740"},null,{"$f":"_xlfn.XLOOKUP(A272,Master!A:A,Master!A:A)","v":"SS740"}]
["SS770","SEVEN SEAS Soft Denim | modern | Damen","SEVEN SEAS Soft Denim | modern | dam","SEVEN SEAS Soft Denim | modern | women","SEVEN SEAS Soft Denim | modern | dame","SEVEN SEAS Soft Denim | modern | dame","SEVEN SEAS Soft Denim | modern | damski",null,null,null,null,null,null,{"$f":"_xlfn.XLOOKUP(A273,Master!$A:$A,Master!$A:$A)","v":"SS770"},null,{"$f":"_xlfn.XLOOKUP(A273,Master!A:A,Master!A:A)","v":"SS770"}]
["SS8","SEVEN SEAS Fine Twill | modern","SEVEN SEAS Fine Twill | modern","SEVEN SEAS Fine Twill | modern","SEVEN SEAS Fine Twill | modern","SEVEN SEAS Fine Twill | modern","SEVEN SEAS Fine Twill | modern",null,null,null,null,null,null,{"$f":"_xlfn.XLOOKUP(A274,Master!$A:$A,Master!$A:$A)","v":"SS8"},null,{"$f":"_xlfn.XLOOKUP(A274,Master!A:A,Master!A:A)","v":"SS8"}]
["Grand Total",null,null,null,null,null,null,null,null,null,null,null,null,{"$f":"_xlfn.XLOOKUP(A275,Master!$A:$A,Master!$A:$A)","v":{"$error":"#N/A"}},null,{"$f":"_xlfn.XLOOKUP(A275,Master!A:A,Master!A:A)","v":{"$error":"#N/A"}}]
[null,null,null,null,null,null,null,null,null,null,null,null,null,{"$f":"_xlfn.XLOOKUP(A276,Master!$A:$A,Master!$A:$A)","v":0},null,{"$f":"_xlfn.XLOOKUP(A276,Master!A:A,Master!A:A)","v":0}]
[null,null,null,null,null,null,null,null,null,null,null,null,null,{"$f":"_xlfn.XLOOKUP(A277,Master!$A:$A,Master!$A:$A)","v":0},null,{"$f":"_xlfn.XLOOKUP(A277,Master!A:A,Master!A:A)","v":0}]
[null,null,null,null,null,null,null,null,null,null,null,null,null,{"$f":"_xlfn.XLOOKUP(A278,Master!$A:$A,Master!$A:$A)","v":{"$error":"#N/A"}},null,{"$f":"_xlfn.XLOOKUP(A278,Master!A:A,Master!A:A)","v":0}]
[null,null,null,null,null,null,null,null,null,null,null,null,null,{"$f":"_xlfn.XLOOKUP(A279,Master!$A:$A,Master!$A:$A)","v":0},null,{"$f":"_xlfn.XLOOKUP(A279,Master!A:A,Master!A:A)","v":{"$error":"#N/A"}}]
[null,null,null,null,null,null,null,null,null,null,null,null,null,{"$f":"_xlfn.XLOOKUP(A280,Master!$A:$A,Master!$A:$A)","v":0},null,{"$f":"_xlfn.XLOOKUP(A280,Master!A:A,Master!A:A)","v":{"$error":"#N/A"}}]
[null,null,null,null,null,null,null,null,null,null,null,null,null,{"$f":"_xlfn.XLOOKUP(A281,Master!$A:$A,Master!$A:$A)","v":0},null,{"$f":"_xlfn.XLOOKUP(A281,Master!A:A,Master!A:A)","v":0}]
[null,null,null,null,null,null,null,null,null,null,null,null,null,{"$f":"_xlfn.XLOOKUP(A282,Master!$A:$A,Master!$A:$A)","v":0},null,{"$f":"_xlfn.XLOOKUP(A282,Master!A:A,Master!A:A)","v":0}]
[null,null,null,null,null,null,null,null,null,null,null,null,null,{"$f":"_xlfn.XLOOKUP(A283,Master!$A:$A,Master!$A:$A)","v":{"$error":"#N/A"}},null,{"$f":"_xlfn.XLOOKUP(A283,Master!A:A,Master!A:A)","v":0}]
[null,null,null,null,null,null,null,null,null,null,null,null,null,{"$f":"_xlfn.XLOOKUP(A284,Master!$A:$A,Master!$A:$A)","v":{"$error":"#N/A"}},null,{"$f":"_xlfn.XLOOKUP(A284,Master!A:A,Master!A:A)","v":{"$error":"#N/A"}}]
[null,null,null,null,null,null,null,null,null,null,null,null,null,{"$f":"_xlfn.XLOOKUP(A285,Master!$A:$A,Master!$A:$A)","v":0},null,{"$f":"_xlfn.XLOOKUP(A285,Master!A:A,Master!A:A)","v":0}]
[null,null,null,null,null,null,null,null,null,null,null,null,null,{"$f":"_xlfn.XLOOKUP(A286,Master!$A:$A,Master!$A:$A)","v":0},null,{"$f":"_xlfn.XLOOKUP(A286,Master!A:A,Master!A:A)","v":0}]
[null,null,null,null,null,null,null,null,null,null,null,null,null,{"$f":"_xlfn.XLOOKUP(A287,Master!$A:$A,Master!$A:$A)","v":{"$error":"#N/A"}},null,{"$f":"_xlfn.XLOOKUP(A287,Master!A:A,Master!A:A)","v":0}]
[null,null,null,null,null,null,null,null,null,null,null,null,null,{"$f":"_xlfn.XLOOKUP(A288,Master!$A:$A,Master!$A:$A)","v":{"$error":"#N/A"}},null,{"$f":"_xlfn.XLOOKUP(A288,Master!A:A,Master!A:A)","v":0}]
[null,null,null,null,null,null,null,null,null,null,null,null,null,{"$f":"_xlfn.XLOOKUP(A289,Master!$A:$A,Master!$A:$A)","v":0},null,{"$f":"_xlfn.XLOOKUP(A289,Master!A:A,Master!A:A)","v":{"$error":"#N/A"}}]
[null,null,null,null,null,null,null,null,null,null,null,null,null,{"$f":"_xlfn.XLOOKUP(A290,Master!$A:$A,Master!$A:$A)","v":0},null,{"$f":"_xlfn.XLOOKUP(A290,Master!A:A,Master!A:A)","v":0}]
[null,null,null,null,null,null,null,null,null,null,null,null,null,{"$f":"_xlfn.XLOOKUP(A291,Master!$A:$A,Master!$A:$A)","v":0},null,{"$f":"_xlfn.XLOOKUP(A291,Master!A:A,Master!A:A)","v":0}]
[null,null,null,null,null,null,null,null,null,null,null,null,null,{"$f":"_xlfn.XLOOKUP(A292,Master!$A:$A,Master!$A:$A)","v":{"$error":"#N/A"}},null,{"$f":"_xlfn.XLOOKUP(A292,Master!A:A,Master!A:A)","v":0}]
[null,null,null,null,null,null,null,null,null,null,null,null,null,{"$f":"_xlfn.XLOOKUP(A293,Master!$A:$A,Master!$A:$A)","v":{"$error":"#N/A"}},null,{"$f":"_xlfn.XLOOKUP(A293,Master!A:A,Master!A:A)","v":0}]
[null,null,null,null,null,null,null,null,null,null,null,null,null,{"$f":"_xlfn.XLOOKUP(A294,Master!$A:$A,Master!$A:$A)","v":{"$error":"#N/A"}},null,{"$f":"_xlfn.XLOOKUP(A294,Master!A:A,Master!A:A)","v":0}]
[null,null,null,null,null,null,null,null,null,null,null,null,null,{"$f":"_xlfn.XLOOKUP(A295,Master!$A:$A,Master!$A:$A)","v":{"$error":"#N/A"}},null,{"$f":"_xlfn.XLOOKUP(A295,Master!A:A,Master!A:A)","v":0}]
[null,null,null,null,null,null,null,null,null,null,null,null,null,{"$f":"_xlfn.XLOOKUP(A296,Master!$A:$A,Master!$A:$A)","v":0},null,{"$f":"_xlfn.XLOOKUP(A296,Master!A:A,Master!A:A)","v":0}]
[null,null,null,null,null,null,null,null,null,null,null,null,null,{"$f":"_xlfn.XLOOKUP(A297,Master!$A:$A,Master!$A:$A)","v":{"$error":"#N/A"}},null,{"$f":"_xlfn.XLOOKUP(A297,Master!A:A,Master!A:A)","v":{"$error":"#N/A"}}]
[null,null,null,null,null,null,null,null,null,null,null,null,null,{"$f":"_xlfn.XLOOKUP(A298,Master!$A:$A,Master!$A:$A)","v":0},null,{"$f":"_xlfn.XLOOKUP(A298,Master!A:A,Master!A:A)","v":0}]
[null,null,null,null,null,null,null,null,null,null,null,null,null,{"$f":"_xlfn.XLOOKUP(A299,Master!$A:$A,Master!$A:$A)","v":0},null,{"$f":"_xlfn.XLOOKUP(A299,Master!A:A,Master!A:A)","v":0}]
[null,null,null,null,null,null,null,null,null,null,null,null,null,{"$f":"_xlfn.XLOOKUP(A300,Master!$A:$A,Master!$A:$A)","v":0},null,{"$f":"_xlfn.XLOOKUP(A300,Master!A:A,Master!A:A)","v":0}]
[null,null,null,null,null,null,null,null,null,null,null,null,null,{"$f":"_xlfn.XLOOKUP(A301,Master!$A:$A,Master!$A:$A)","v":{"$error":"#N/A"}},null,{"$f":"_xlfn.XLOOKUP(A301,Master!A:A,Master!A:A)","v":0}]
[null,null,null,null,null,null,null,null,null,null,null,null,null,{"$f":"_xlfn.XLOOKUP(A302,Master!$A:$A,Master!$A:$A)","v":{"$error":"#N/A"}},null,{"$f":"_xlfn.XLOOKUP(A302,Master!A:A,Master!A:A)","v":0}]
[null,null,null,null,null,null,null,null,null,null,null,null,null,{"$f":"_xlfn.XLOOKUP(A303,Master!$A:$A,Master!$A:$A)","v":0},null,{"$f":"_xlfn.XLOOKUP(A303,Master!A:A,Master!A:A)","v":0}]
[null,null,null,null,null,null,null,null,null,null,null,null,null,{"$f":"_xlfn.XLOOKUP(A304,Master!$A:$A,Master!$A:$A)","v":0},null,{"$f":"_xlfn.XLOOKUP(A304,Master!A:A,Master!A:A)","v":0}]
[null,null,null,null,null,null,null,null,null,null,null,null,null,{"$f":"_xlfn.XLOOKUP(A305,Master!$A:$A,Master!$A:$A)","v":0},null,{"$f":"_xlfn.XLOOKUP(A305,Master!A:A,Master!A:A)","v":0}]
[null,null,null,null,null,null,null,null,null,null,null,null,null,{"$f":"_xlfn.XLOOKUP(A306,Master!$A:$A,Master!$A:$A)","v":{"$error":"#N/A"}},null,{"$f":"_xlfn.XLOOKUP(A306,Master!A:A,Master!A:A)","v":0}]
[null,null,null,null,null,null,null,null,null,null,null,null,null,{"$f":"_xlfn.XLOOKUP(A307,Master!$A:$A,Master!$A:$A)","v":0},null,{"$f":"_xlfn.XLOOKUP(A307,Master!A:A,Master!A:A)","v":0}]
[null,null,null,null,null,null,null,null,null,null,null,null,null,{"$f":"_xlfn.XLOOKUP(A308,Master!$A:$A,Master!$A:$A)","v":0},null,{"$f":"_xlfn.XLOOKUP(A308,Master!A:A,Master!A:A)","v":0}]
[null,null,null,null,null,null,null,null,null,null,null,null,null,{"$f":"_xlfn.XLOOKUP(A309,Master!$A:$A,Master!$A:$A)","v":0},null,{"$f":"_xlfn.XLOOKUP(A309,Master!A:A,Master!A:A)","v":0}]
[null,null,null,null,null,null,null,null,null,null,null,null,null,{"$f":"_xlfn.XLOOKUP(A310,Master!$A:$A,Master!$A:$A)","v":{"$error":"#N/A"}},null,{"$f":"_xlfn.XLOOKUP(A310,Master!A:A,Master!A:A)","v":0}]
[null,null,null,null,null,null,null,null,null,null,null,null,null,{"$f":"_xlfn.XLOOKUP(A311,Master!$A:$A,Master!$A:$A)","v":{"$error":"#N/A"}},null,{"$f":"_xlfn.XLOOKUP(A311,Master!A:A,Master!A:A)","v":0}]
[null,null,null,null,null,null,null,null,null,null,null,null,null,{"$f":"_xlfn.XLOOKUP(A312,Master!$A:$A,Master!$A:$A)","v":{"$error":"#N/A"}},null,{"$f":"_xlfn.XLOOKUP(A312,Master!A:A,Master!A:A)","v":0}]
[null,null,null,null,null,null,null,null,null,null,null,null,null,{"$f":"_xlfn.XLOOKUP(A313,Master!$A:$A,Master!$A:$A)","v":0},null,{"$f":"_xlfn.XLOOKUP(A313,Master!A:A,Master!A:A)","v":0}]
[null,null,null,null,null,null,null,null,null,null,null,null,null,{"$f":"_xlfn.XLOOKUP(A314,Master!$A:$A,Master!$A:$A)","v":0},null,{"$f":"_xlfn.XLOOKUP(A314,Master!A:A,Master!A:A)","v":0}]
[null,null,null,null,null,null,null,null,null,null,null,null,null,{"$f":"_xlfn.XLOOKUP(A315,Master!$A:$A,Master!$A:$A)","v":{"$error":"#N/A"}},null,{"$f":"_xlfn.XLOOKUP(A315,Master!A:A,Master!A:A)","v":0}]
[null,null,null,null,null,null,null,null,null,null,null,null,null,{"$f":"_xlfn.XLOOKUP(A316,Master!$A:$A,Master!$A:$A)","v":0},null,{"$f":"_xlfn.XLOOKUP(A316,Master!A:A,Master!A:A)","v":0}]
[null,null,null,null,null,null,null,null,null,null,null,null,null,null,null,{"$f":"_xlfn.XLOOKUP(A317,Master!A:A,Master!A:A)","v":0}]
[null,null,null,null,null,null,null,null,null,null,null,null,null,null,null,{"$f":"_xlfn.XLOOKUP(A318,Master!A:A,Master!A:A)","v":0}]
[null,null,null,null,null,null,null,null,null,null,null,null,null,null,null,{"$f":"_xlfn.XLOOKUP(A319,Master!A:A,Master!A:A)","v":0}]
[null,null,null,null,null,null,null,null,null,null,null,null,null,null,null,{"$f":"_xlfn.XLOOKUP(A320,Master!A:A,Master!A:A)","v":0}]
[null,null,null,null,null,null,null,null,null,null,null,null,null,null,null,{"$f":"_xlfn.XLOOKUP(A321,Master!A:A,Master!A:A)","v":0}]
[null,null,null,null,null,null,null,null,null,null,null,null,null,null,null,{"$f":"_xlfn.XLOOKUP(A322,Master!A:A,Master!A:A)","v":{"$error":"#N/A"}}]
[null,null,null,null,null,null,null,null,null,null,null,null,null,null,null,{"$f":"_xlfn.XLOOKUP(A323,Master!A:A,Master!A:A)","v":0}]
[null,null,null,null,null,null,null,null,null,null,null,null,null,null,null,{"$f":"_xlfn.XLOOKUP(A324,Master!A:A,Master!A:A)","v":0}]
[null,null,null,null,null,null,null,null,null,null,null,null,null,null,null,{"$f":"_xlfn.XLOOKUP(A325,Master!A:A,Master!A:A)","v":0}]
[null,null,null,null,null,null,null,null,null,null,null,null,null,null,null,{"$f":"_xlfn.XLOOKUP(A326,Master!A:A,Master!A:A)","v":0}]
[null,null,null,null,null,null,null,null,null,null,null,null,null,null,null,{"$f":"_xlfn.XLOOKUP(A327,Master!A:A,Master!A:A)","v":0}]
[null,null,null,null,null,null,null,null,null,null,null,null,null,null,null,{"$f":"_xlfn.XLOOKUP(A328,Master!A:A,Master!A:A)","v":0}]
[null,null,null,null,null,null,null,null,null,null,null,null,null,null,null,{"$f":"_xlfn.XLOOKUP(A329,Master!A:A,Master!A:A)","v":0}]
[null,null,null,null,null,null,null,null,null,null,null,null,null,null,null,{"$f":"_xlfn.XLOOKUP(A330,Master!A:A,Master!A:A)","v":{"$error":"#N/A"}}]
[null,null,null,null,null,null,null,null,null,null,null,null,null,null,null,{"$f":"_xlfn.XLOOKUP(A331,Master!A:A,Master!A:A)","v":{"$error":"#N/A"}}]
[null,null,null,null,null,null,null,null,null,null,null,null,null,null,null,{"$f":"_xlfn.XLOOKUP(A332,Master!A:A,Master!A:A)","v":0}]
[null,null,null,null,null,null,null,null,null,null,null,null,null,null,null,{"$f":"_xlfn.XLOOKUP(A333,Master!A:A,Master!A:A)","v":0}]
[null,null,null,null,null,null,null,null,null,null,null,null,null,null,null,{"$f":"_xlfn.XLOOKUP(A334,Master!A:A,Master!A:A)","v":0}]
[null,null,null,null,null,null,null,null,null,null,null,null,null,null,null,{"$f":"_xlfn.XLOOKUP(A335,Master!A:A,Master!A:A)","v":{"$error":"#N/A"}}]
[null,null,null,null,null,null,null,null,null,null,null,null,null,null,null,{"$f":"_xlfn.XLOOKUP(A336,Master!A:A,Master!A:A)","v":{"$error":"#N/A"}}]
[null,null,null,null,null,null,null,null,null,null,null,null,null,null,null,{"$f":"_xlfn.XLOOKUP(A337,Master!A:A,Master!A:A)","v":0}]
[null,null,null,null,null,null,null,null,null,null,null,null,null,null,null,{"$f":"_xlfn.XLOOKUP(A338,Master!A:A,Master!A:A)","v":0}]
[null,null,null,null,null,null,null,null,null,null,null,null,null,null,null,{"$f":"_xlfn.XLOOKUP(A339,Master!A:A,Master!A:A)","v":{"$error":"#N/A"}}]
[null,null,null,null,null,null,null,null,null,null,null,null,null,null,null,{"$f":"_xlfn.XLOOKUP(A340,Master!A:A,Master!A:A)","v":0}]
[null,null,null,null,null,null,null,null,null,null,null,null,null,null,null,{"$f":"_xlfn.XLOOKUP(A341,Master!A:A,Master!A:A)","v":0}]
[null,null,null,null,null,null,null,null,null,null,null,null,null,null,null,{"$f":"_xlfn.XLOOKUP(A342,Master!A:A,Master!A:A)","v":0}]
[null,null,null,null,null,null,null,null,null,null,null,null,null,null,null,{"$f":"_xlfn.XLOOKUP(A343,Master!A:A,Master!A:A)","v":{"$error":"#N/A"}}]
[null,null,null,null,null,null,null,null,null,null,null,null,null,null,null,{"$f":"_xlfn.XLOOKUP(A344,Master!A:A,Master!A:A)","v":{"$error":"#N/A"}}]
[null,null,null,null,null,null,null,null,null,null,null,null,null,null,null,{"$f":"_xlfn.XLOOKUP(A345,Master!A:A,Master!A:A)","v":0}]
[null,null,null,null,null,null,null,null,null,null,null,null,null,null,null,{"$f":"_xlfn.XLOOKUP(A346,Master!A:A,Master!A:A)","v":0}]
[null,null,null,null,null,null,null,null,null,null,null,null,null,null,null,{"$f":"_xlfn.XLOOKUP(A347,Master!A:A,Master!A:A)","v":0}]
[null,null,null,null,null,null,null,null,null,null,null,null,null,null,null,{"$f":"_xlfn.XLOOKUP(A348,Master!A:A,Master!A:A)","v":{"$error":"#N/A"}}]
[null,null,null,null,null,null,null,null,null,null,null,null,null,null,null,{"$f":"_xlfn.XLOOKUP(A349,Master!A:A,Master!A:A)","v":0}]