{"text_format":"1","workbook":"xlsx","n_sheets":4,"sheets":["Selection","Master","Factor","Style navne sprog"],"not_rendered":{"charts":0,"images":1,"macros":1,"external_links":0,"defined_names":41,"comments":0,"pivot_tables":1},"unopened":[],"bounds":{"document_bytes":16777216,"sheet_cells":100000,"rows_first":2000,"rows_last":500,"rows_between":2000,"halvings":0,"cell_chars":16384,"cell_head_chars":4096},"cells_cut":0,"cells_raw":0,"read":"whole","date_system":"1900"}

{"sheet":"Selection","index":0,"n_rows":4,"n_cols":2,"rows_kept":4,"cut":false,"hidden":false,"merged":[]}
[]
[]
["Factor",2]
["Language","GB"]

{"sheet":"Master","index":1,"n_rows":296,"n_cols":6,"rows_kept":296,"cut":false,"hidden":false,"merged":[[3,4,3,5],[4,4,4,5]]}
["Style","Beskrivelse","EUR Forhandler 1 stk   ","EUR Forhandler 50 stk ","Str.","EUR Forhandler overstr. "]
["a","a",0,null,null,0]
["NO.",{"$f":"IF(Selection!$B$4=\"DK\",\"PRODUKTNAVN\",IF(Selection!$B$4=\"DE\",\"PRODUKTNAME\",IF(Selection!$B$4=\"GB\",\"PRODUCT NAME\",IF(Selection!$B$4=\"SE\",\"PRODUKTNAMN\",IF(Selection!$B$4=\"NO\",\"PRODUKTNAVN\",IF(Selection!$B$4=\"PL\",\"NAZWA PRODUKTU\"))))))","v":"PRODUCT NAME"},"PREIS"]
["-",null,"EUR",null,"SIZE ADD-ON EUR"]
[null,null,"1 pcs","100 pcs","1 pcs"]
[]
[{"$f":"IF(Selection!$B$4=\"PL\",\"T-SHIRTY\",IF(Selection!$B$4=\"NO\",\"T-SKJORTER\",\"T-SHIRTS\"))","v":"T-SHIRTS"}]
["0500",{"$f":"IF(Selection!$B$4=\"DK\",VLOOKUP($A8,'Style navne sprog'!$A:$I,6,FALSE),IF(Selection!$B$4=\"DE\",VLOOKUP($A8,'Style navne sprog'!$A:$I,2,FALSE),IF(Selection!$B$4=\"GB\",VLOOKUP($A8,'Style navne sprog'!$A:$I,4,FALSE),IF(Selection!$B$4=\"SE\",VLOOKUP($A8,'Style navne sprog'!$A:$I,3,FALSE),IF(Selection!$B$4=\"NO\",VLOOKUP($A8,'Style navne sprog'!$A:$I,5,FALSE),IF(Selection!$B$4=\"PL\",VLOOKUP($A8,'Style navne sprog'!$A:$I,7,FALSE)))))))","v":"GAME® T-shirt"},8.4500000000000011,7.8000000000000007,"3XL",1.4000000000000001]
["0502",{"$f":"IF(Selection!$B$4=\"DK\",VLOOKUP($A9,'Style navne sprog'!$A:$I,6,FALSE),IF(Selection!$B$4=\"DE\",VLOOKUP($A9,'Style navne sprog'!$A:$I,2,FALSE),IF(Selection!$B$4=\"GB\",VLOOKUP($A9,'Style navne sprog'!$A:$I,4,FALSE),IF(Selection!$B$4=\"SE\",VLOOKUP($A9,'Style navne sprog'!$A:$I,3,FALSE),IF(Selection!$B$4=\"NO\",VLOOKUP($A9,'Style navne sprog'!$A:$I,5,FALSE),IF(Selection!$B$4=\"PL\",VLOOKUP($A9,'Style navne sprog'!$A:$I,7,FALSE)))))))","v":"T-TIME® T-shirt | tight"},10.55,9.8500000000000014,"3XL",1.4000000000000001]
["0506",{"$f":"IF(Selection!$B$4=\"DK\",VLOOKUP($A10,'Style navne sprog'!$A:$I,6,FALSE),IF(Selection!$B$4=\"DE\",VLOOKUP($A10,'Style navne sprog'!$A:$I,2,FALSE),IF(Selection!$B$4=\"GB\",VLOOKUP($A10,'Style navne sprog'!$A:$I,4,FALSE),IF(Selection!$B$4=\"SE\",VLOOKUP($A10,'Style navne sprog'!$A:$I,3,FALSE),IF(Selection!$B$4=\"NO\",VLOOKUP($A10,'Style navne sprog'!$A:$I,5,FALSE),IF(Selection!$B$4=\"PL\",VLOOKUP($A10,'Style navne sprog'!$A:$I,7,FALSE)))))))","v":"Interlock T-shirt | v-neck | women"},14.75,14.100000000000001,"3XL-4XL",1.4000000000000001]
["0508",{"$f":"IF(Selection!$B$4=\"DK\",VLOOKUP($A11,'Style navne sprog'!$A:$I,6,FALSE),IF(Selection!$B$4=\"DE\",VLOOKUP($A11,'Style navne sprog'!$A:$I,2,FALSE),IF(Selection!$B$4=\"GB\",VLOOKUP($A11,'Style navne sprog'!$A:$I,4,FALSE),IF(Selection!$B$4=\"SE\",VLOOKUP($A11,'Style navne sprog'!$A:$I,3,FALSE),IF(Selection!$B$4=\"NO\",VLOOKUP($A11,'Style navne sprog'!$A:$I,5,FALSE),IF(Selection!$B$4=\"PL\",VLOOKUP($A11,'Style navne sprog'!$A:$I,7,FALSE)))))))","v":"Interlock T-shirt | women"},14.75,14.100000000000001,"3XL-4XL",1.4000000000000001]
["0509",{"$f":"IF(Selection!$B$4=\"DK\",VLOOKUP($A12,'Style navne sprog'!$A:$I,6,FALSE),IF(Selection!$B$4=\"DE\",VLOOKUP($A12,'Style navne sprog'!$A:$I,2,FALSE),IF(Selection!$B$4=\"GB\",VLOOKUP($A12,'Style navne sprog'!$A:$I,4,FALSE),IF(Selection!$B$4=\"SE\",VLOOKUP($A12,'Style navne sprog'!$A:$I,3,FALSE),IF(Selection!$B$4=\"NO\",VLOOKUP($A12,'Style navne sprog'!$A:$I,5,FALSE),IF(Selection!$B$4=\"PL\",VLOOKUP($A12,'Style navne sprog'!$A:$I,7,FALSE)))))))","v":"Interlock T-shirt | long-sleeved | women"},18.7,18.05,"3XL-4XL",1.4000000000000001]
["0510",{"$f":"IF(Selection!$B$4=\"DK\",VLOOKUP($A13,'Style navne sprog'!$A:$I,6,FALSE),IF(Selection!$B$4=\"DE\",VLOOKUP($A13,'Style navne sprog'!$A:$I,2,FALSE),IF(Selection!$B$4=\"GB\",VLOOKUP($A13,'Style navne sprog'!$A:$I,4,FALSE),IF(Selection!$B$4=\"SE\",VLOOKUP($A13,'Style navne sprog'!$A:$I,3,FALSE),IF(Selection!$B$4=\"NO\",VLOOKUP($A13,'Style navne sprog'!$A:$I,5,FALSE),IF(Selection!$B$4=\"PL\",VLOOKUP($A13,'Style navne sprog'!$A:$I,7,FALSE)))))))","v":"T-TIME® T-shirt"},10.55,9.8500000000000014,"3XL-6XL",1.4000000000000001]
["0511",{"$f":"IF(Selection!$B$4=\"DK\",VLOOKUP($A14,'Style navne sprog'!$A:$I,6,FALSE),IF(Selection!$B$4=\"DE\",VLOOKUP($A14,'Style navne sprog'!$A:$I,2,FALSE),IF(Selection!$B$4=\"GB\",VLOOKUP($A14,'Style navne sprog'!$A:$I,4,FALSE),IF(Selection!$B$4=\"SE\",VLOOKUP($A14,'Style navne sprog'!$A:$I,3,FALSE),IF(Selection!$B$4=\"NO\",VLOOKUP($A14,'Style navne sprog'!$A:$I,5,FALSE),IF(Selection!$B$4=\"PL\",VLOOKUP($A14,'Style navne sprog'!$A:$I,7,FALSE)))))))","v":"T-TIME® T-shirt | women"},10.55,9.8500000000000014,"3XL-6XL",1.4000000000000001]
["0514",{"$f":"IF(Selection!$B$4=\"DK\",VLOOKUP($A15,'Style navne sprog'!$A:$I,6,FALSE),IF(Selection!$B$4=\"DE\",VLOOKUP($A15,'Style navne sprog'!$A:$I,2,FALSE),IF(Selection!$B$4=\"GB\",VLOOKUP($A15,'Style navne sprog'!$A:$I,4,FALSE),IF(Selection!$B$4=\"SE\",VLOOKUP($A15,'Style navne sprog'!$A:$I,3,FALSE),IF(Selection!$B$4=\"NO\",VLOOKUP($A15,'Style navne sprog'!$A:$I,5,FALSE),IF(Selection!$B$4=\"PL\",VLOOKUP($A15,'Style navne sprog'!$A:$I,7,FALSE)))))))","v":"T-TIME® T-shirt | v-neck"},10.55,9.8500000000000014,"",""]
["0517",{"$f":"IF(Selection!$B$4=\"DK\",VLOOKUP($A16,'Style navne sprog'!$A:$I,6,FALSE),IF(Selection!$B$4=\"DE\",VLOOKUP($A16,'Style navne sprog'!$A:$I,2,FALSE),IF(Selection!$B$4=\"GB\",VLOOKUP($A16,'Style navne sprog'!$A:$I,4,FALSE),IF(Selection!$B$4=\"SE\",VLOOKUP($A16,'Style navne sprog'!$A:$I,3,FALSE),IF(Selection!$B$4=\"NO\",VLOOKUP($A16,'Style navne sprog'!$A:$I,5,FALSE),IF(Selection!$B$4=\"PL\",VLOOKUP($A16,'Style navne sprog'!$A:$I,7,FALSE)))))))","v":"Interlock T-shirt"},14.75,14.100000000000001,"3XL",1.4000000000000001]
["0518",{"$f":"IF(Selection!$B$4=\"DK\",VLOOKUP($A17,'Style navne sprog'!$A:$I,6,FALSE),IF(Selection!$B$4=\"DE\",VLOOKUP($A17,'Style navne sprog'!$A:$I,2,FALSE),IF(Selection!$B$4=\"GB\",VLOOKUP($A17,'Style navne sprog'!$A:$I,4,FALSE),IF(Selection!$B$4=\"SE\",VLOOKUP($A17,'Style navne sprog'!$A:$I,3,FALSE),IF(Selection!$B$4=\"NO\",VLOOKUP($A17,'Style navne sprog'!$A:$I,5,FALSE),IF(Selection!$B$4=\"PL\",VLOOKUP($A17,'Style navne sprog'!$A:$I,7,FALSE)))))))","v":"Interlock T-shirt | long-sleeved"},18.7,18.05,"3XL",1.4000000000000001]
["0524",{"$f":"IF(Selection!$B$4=\"DK\",VLOOKUP($A18,'Style navne sprog'!$A:$I,6,FALSE),IF(Selection!$B$4=\"DE\",VLOOKUP($A18,'Style navne sprog'!$A:$I,2,FALSE),IF(Selection!$B$4=\"GB\",VLOOKUP($A18,'Style navne sprog'!$A:$I,4,FALSE),IF(Selection!$B$4=\"SE\",VLOOKUP($A18,'Style navne sprog'!$A:$I,3,FALSE),IF(Selection!$B$4=\"NO\",VLOOKUP($A18,'Style navne sprog'!$A:$I,5,FALSE),IF(Selection!$B$4=\"PL\",VLOOKUP($A18,'Style navne sprog'!$A:$I,7,FALSE)))))))","v":"RE-CARE T-shirt | unisex"},21.35,20.650000000000002,"3XL-4XL",1.4000000000000001]
["0528",{"$f":"IF(Selection!$B$4=\"DK\",VLOOKUP($A19,'Style navne sprog'!$A:$I,6,FALSE),IF(Selection!$B$4=\"DE\",VLOOKUP($A19,'Style navne sprog'!$A:$I,2,FALSE),IF(Selection!$B$4=\"GB\",VLOOKUP($A19,'Style navne sprog'!$A:$I,4,FALSE),IF(Selection!$B$4=\"SE\",VLOOKUP($A19,'Style navne sprog'!$A:$I,3,FALSE),IF(Selection!$B$4=\"NO\",VLOOKUP($A19,'Style navne sprog'!$A:$I,5,FALSE),IF(Selection!$B$4=\"PL\",VLOOKUP($A19,'Style navne sprog'!$A:$I,7,FALSE)))))))","v":"T-shirt Lyocell"},19.600000000000001,18.95,"3XL-6XL",1.4000000000000001]
["0529",{"$f":"IF(Selection!$B$4=\"DK\",VLOOKUP($A20,'Style navne sprog'!$A:$I,6,FALSE),IF(Selection!$B$4=\"DE\",VLOOKUP($A20,'Style navne sprog'!$A:$I,2,FALSE),IF(Selection!$B$4=\"GB\",VLOOKUP($A20,'Style navne sprog'!$A:$I,4,FALSE),IF(Selection!$B$4=\"SE\",VLOOKUP($A20,'Style navne sprog'!$A:$I,3,FALSE),IF(Selection!$B$4=\"NO\",VLOOKUP($A20,'Style navne sprog'!$A:$I,5,FALSE),IF(Selection!$B$4=\"PL\",VLOOKUP($A20,'Style navne sprog'!$A:$I,7,FALSE)))))))","v":"T-shirt Lyocell | women"},19.600000000000001,18.95,"3XL-6XL",1.4000000000000001]
{"$rows_left_out":277}
{"sheet":"Factor","index":2,"n_rows":296,"n_cols":7,"rows_kept":296,"cut":false,"hidden":false,"merged":[[4,4,4,5]]}
["Style","Beskrivelse"]
["a","a",0,null,null,0]
["NO.",{"$f":"IF(Selection!$B$4=\"DK\",\"PRODUKTNAVN\",IF(Selection!$B$4=\"DE\",\"PRODUKTNAME\",IF(Selection!$B$4=\"GB\",\"PRODUCT NAME\",IF(Selection!$B$4=\"SE\",\"PRODUKTNAMN\",IF(Selection!$B$4=\"NO\",\"PRODUKTNAVN\",IF(Selection!$B$4=\"PL\",\"NAZWA PRODUKTU\"))))))","v":"PRODUCT NAME"},{"$f":"IF(Selection!$B$4=\"GB\",\"PRICE VAT EXCLUSIVE\",\"PREIS EX. MWST.\")","v":"PRICE VAT EXCLUSIVE"}]
["-",null,"EUR",null,{"$f":"IF(Selection!$B$4=\"GB\",\"SIZE ADD-ON EUR\",\"GRÖSSEN ZZGL.EUR\")","v":"SIZE ADD-ON EUR"}]
[null,null,{"$f":"IF(Selection!$B$4=\"GB\",\"1 pcs\",\"1 Stück\")","v":"1 pcs"},"100 pcs",{"$f":"IF(Selection!$B$4=\"GB\",\"1 pcs\",\"1 Stück\")","v":"1 pcs"}]
[]
[{"$f":"IF(Selection!$B$4=\"PL\",\"T-SHIRTY\",IF(Selection!$B$4=\"NO\",\"T-SKJORTER\",\"T-SHIRTS\"))","v":"T-SHIRTS"}]
["0500",{"$f":"IF(Selection!$B$4=\"DK\",VLOOKUP($A8,'Style navne sprog'!$A:$I,6,FALSE),IF(Selection!$B$4=\"DE\",VLOOKUP($A8,'Style navne sprog'!$A:$I,2,FALSE),IF(Selection!$B$4=\"GB\",VLOOKUP($A8,'Style navne sprog'!$A:$I,4,FALSE),IF(Selection!$B$4=\"SE\",VLOOKUP($A8,'Style navne sprog'!$A:$I,3,FALSE),IF(Selection!$B$4=\"NO\",VLOOKUP($A8,'Style navne sprog'!$A:$I,5,FALSE),IF(Selection!$B$4=\"PL\",VLOOKUP($A8,'Style navne sprog'!$A:$I,7,FALSE)))))))","v":"GAME® T-shirt"},{"$f":"IF(Master!C8<>\"\",Master!C8*Selection!$B$3,\"\")","v":16.900000000000002},{"$f":"IF(Master!D8<>\"\",Master!D8*Selection!$B$3,\"\")","v":15.600000000000001},"3XL",{"$f":"IF(Master!F8<>\"\",Master!F8*Selection!$B$3,\"\")","v":2.8000000000000003},{"$f":"IF(Factor!#REF!<>\"\",Factor!#REF!*Selection!$B$3,\"\")","v":{"$error":"#REF!"}}]
["0502",{"$f":"IF(Selection!$B$4=\"DK\",VLOOKUP($A9,'Style navne sprog'!$A:$I,6,FALSE),IF(Selection!$B$4=\"DE\",VLOOKUP($A9,'Style navne sprog'!$A:$I,2,FALSE),IF(Selection!$B$4=\"GB\",VLOOKUP($A9,'Style navne sprog'!$A:$I,4,FALSE),IF(Selection!$B$4=\"SE\",VLOOKUP($A9,'Style navne sprog'!$A:$I,3,FALSE),IF(Selection!$B$4=\"NO\",VLOOKUP($A9,'Style navne sprog'!$A:$I,5,FALSE),IF(Selection!$B$4=\"PL\",VLOOKUP($A9,'Style navne sprog'!$A:$I,7,FALSE)))))))","v":"T-TIME® T-shirt | tight"},{"$f":"IF(Master!C9<>\"\",Master!C9*Selection!$B$3,\"\")","v":21.1},{"$f":"IF(Master!D9<>\"\",Master!D9*Selection!$B$3,\"\")","v":19.700000000000003},"3XL",{"$f":"IF(Master!F9<>\"\",Master!F9*Selection!$B$3,\"\")","v":2.8000000000000003},{"$f":"IF(Factor!#REF!<>\"\",Factor!#REF!*Selection!$B$3,\"\")","v":{"$error":"#REF!"}}]
["0506",{"$f":"IF(Selection!$B$4=\"DK\",VLOOKUP($A10,'Style navne sprog'!$A:$I,6,FALSE),IF(Selection!$B$4=\"DE\",VLOOKUP($A10,'Style navne sprog'!$A:$I,2,FALSE),IF(Selection!$B$4=\"GB\",VLOOKUP($A10,'Style navne sprog'!$A:$I,4,FALSE),IF(Selection!$B$4=\"SE\",VLOOKUP($A10,'Style navne sprog'!$A:$I,3,FALSE),IF(Selection!$B$4=\"NO\",VLOOKUP($A10,'Style navne sprog'!$A:$I,5,FALSE),IF(Selection!$B$4=\"PL\",VLOOKUP($A10,'Style navne sprog'!$A:$I,7,FALSE)))))))","v":"Interlock T-shirt | v-neck | women"},{"$f":"IF(Master!C10<>\"\",Master!C10*Selection!$B$3,\"\")","v":29.5},{"$f":"IF(Master!D10<>\"\",Master!D10*Selection!$B$3,\"\")","v":28.200000000000003},"3XL-4XL",{"$f":"IF(Master!F10<>\"\",Master!F10*Selection!$B$3,\"\")","v":2.8000000000000003},{"$f":"IF(Factor!#REF!<>\"\",Factor!#REF!*Selection!$B$3,\"\")","v":{"$error":"#REF!"}}]
["0508",{"$f":"IF(Selection!$B$4=\"DK\",VLOOKUP($A11,'Style navne sprog'!$A:$I,6,FALSE),IF(Selection!$B$4=\"DE\",VLOOKUP($A11,'Style navne sprog'!$A:$I,2,FALSE),IF(Selection!$B$4=\"GB\",VLOOKUP($A11,'Style navne sprog'!$A:$I,4,FALSE),IF(Selection!$B$4=\"SE\",VLOOKUP($A11,'Style navne sprog'!$A:$I,3,FALSE),IF(Selection!$B$4=\"NO\",VLOOKUP($A11,'Style navne sprog'!$A:$I,5,FALSE),IF(Selection!$B$4=\"PL\",VLOOKUP($A11,'Style navne sprog'!$A:$I,7,FALSE)))))))","v":"Interlock T-shirt | women"},{"$f":"IF(Master!C11<>\"\",Master!C11*Selection!$B$3,\"\")","v":29.5},{"$f":"IF(Master!D11<>\"\",Master!D11*Selection!$B$3,\"\")","v":28.200000000000003},"3XL-4XL",{"$f":"IF(Master!F11<>\"\",Master!F11*Selection!$B$3,\"\")","v":2.8000000000000003},{"$f":"IF(Factor!#REF!<>\"\",Factor!#REF!*Selection!$B$3,\"\")","v":{"$error":"#REF!"}}]
["0509",{"$f":"IF(Selection!$B$4=\"DK\",VLOOKUP($A12,'Style navne sprog'!$A:$I,6,FALSE),IF(Selection!$B$4=\"DE\",VLOOKUP($A12,'Style navne sprog'!$A:$I,2,FALSE),IF(Selection!$B$4=\"GB\",VLOOKUP($A12,'Style navne sprog'!$A:$I,4,FALSE),IF(Selection!$B$4=\"SE\",VLOOKUP($A12,'Style navne sprog'!$A:$I,3,FALSE),IF(Selection!$B$4=\"NO\",VLOOKUP($A12,'Style navne sprog'!$A:$I,5,FALSE),IF(Selection!$B$4=\"PL\",VLOOKUP($A12,'Style navne sprog'!$A:$I,7,FALSE)))))))","v":"Interlock T-shirt | long-sleeved | women"},{"$f":"IF(Master!C12<>\"\",Master!C12*Selection!$B$3,\"\")","v":37.4},{"$f":"IF(Master!D12<>\"\",Master!D12*Selection!$B$3,\"\")","v":36.1},"3XL-4XL",{"$f":"IF(Master!F12<>\"\",Master!F12*Selection!$B$3,\"\")","v":2.8000000000000003},{"$f":"IF(Factor!#REF!<>\"\",Factor!#REF!*Selection!$B$3,\"\")","v":{"$error":"#REF!"}}]
["0510",{"$f":"IF(Selection!$B$4=\"DK\",VLOOKUP($A13,'Style navne sprog'!$A:$I,6,FALSE),IF(Selection!$B$4=\"DE\",VLOOKUP($A13,'Style navne sprog'!$A:$I,2,FALSE),IF(Selection!$B$4=\"GB\",VLOOKUP($A13,'Style navne sprog'!$A:$I,4,FALSE),IF(Selection!$B$4=\"SE\",VLOOKUP($A13,'Style navne sprog'!$A:$I,3,FALSE),IF(Selection!$B$4=\"NO\",VLOOKUP($A13,'Style navne sprog'!$A:$I,5,FALSE),IF(Selection!$B$4=\"PL\",VLOOKUP($A13,'Style navne sprog'!$A:$I,7,FALSE)))))))","v":"T-TIME® T-shirt"},{"$f":"IF(Master!C13<>\"\",Master!C13*Selection!$B$3,\"\")","v":21.1},{"$f":"IF(Master!D13<>\"\",Master!D13*Selection!$B$3,\"\")","v":19.700000000000003},"3XL-6XL",{"$f":"IF(Master!F13<>\"\",Master!F13*Selection!$B$3,\"\")","v":2.8000000000000003},{"$f":"IF(Factor!#REF!<>\"\",Factor!#REF!*Selection!$B$3,\"\")","v":{"$error":"#REF!"}}]
["0511",{"$f":"IF(Selection!$B$4=\"DK\",VLOOKUP($A14,'Style navne sprog'!$A:$I,6,FALSE),IF(Selection!$B$4=\"DE\",VLOOKUP($A14,'Style navne sprog'!$A:$I,2,FALSE),IF(Selection!$B$4=\"GB\",VLOOKUP($A14,'Style navne sprog'!$A:$I,4,FALSE),IF(Selection!$B$4=\"SE\",VLOOKUP($A14,'Style navne sprog'!$A:$I,3,FALSE),IF(Selection!$B$4=\"NO\",VLOOKUP($A14,'Style navne sprog'!$A:$I,5,FALSE),IF(Selection!$B$4=\"PL\",VLOOKUP($A14,'Style navne sprog'!$A:$I,7,FALSE)))))))","v":"T-TIME® T-shirt | women"},{"$f":"IF(Master!C14<>\"\",Master!C14*Selection!$B$3,\"\")","v":21.1},{"$f":"IF(Master!D14<>\"\",Master!D14*Selection!$B$3,\"\")","v":19.700000000000003},"3XL-6XL",{"$f":"IF(Master!F14<>\"\",Master!F14*Selection!$B$3,\"\")","v":2.8000000000000003},{"$f":"IF(Factor!#REF!<>\"\",Factor!#REF!*Selection!$B$3,\"\")","v":{"$error":"#REF!"}}]
["0514",{"$f":"IF(Selection!$B$4=\"DK\",VLOOKUP($A15,'Style navne sprog'!$A:$I,6,FALSE),IF(Selection!$B$4=\"DE\",VLOOKUP($A15,'Style navne sprog'!$A:$I,2,FALSE),IF(Selection!$B$4=\"GB\",VLOOKUP($A15,'Style navne sprog'!$A:$I,4,FALSE),IF(Selection!$B$4=\"SE\",VLOOKUP($A15,'Style navne sprog'!$A:$I,3,FALSE),IF(Selection!$B$4=\"NO\",VLOOKUP($A15,'Style navne sprog'!$A:$I,5,FALSE),IF(Selection!$B$4=\"PL\",VLOOKUP($A15,'Style navne sprog'!$A:$I,7,FALSE)))))))","v":"T-TIME® T-shirt | v-neck"},{"$f":"IF(Master!C15<>\"\",Master!C15*Selection!$B$3,\"\")","v":21.1},{"$f":"IF(Master!D15<>\"\",Master!D15*Selection!$B$3,\"\")","v":19.700000000000003},"",{"$f":"IF(Master!F15<>\"\",Master!F15*Selection!$B$3,\"\")","v":""},{"$f":"IF(Factor!#REF!<>\"\",Factor!#REF!*Selection!$B$3,\"\")","v":{"$error":"#REF!"}}]
["0517",{"$f":"IF(Selection!$B$4=\"DK\",VLOOKUP($A16,'Style navne sprog'!$A:$I,6,FALSE),IF(Selection!$B$4=\"DE\",VLOOKUP($A16,'Style navne sprog'!$A:$I,2,FALSE),IF(Selection!$B$4=\"GB\",VLOOKUP($A16,'Style navne sprog'!$A:$I,4,FALSE),IF(Selection!$B$4=\"SE\",VLOOKUP($A16,'Style navne sprog'!$A:$I,3,FALSE),IF(Selection!$B$4=\"NO\",VLOOKUP($A16,'Style navne sprog'!$A:$I,5,FALSE),IF(Selection!$B$4=\"PL\",VLOOKUP($A16,'Style navne sprog'!$A:$I,7,FALSE)))))))","v":"Interlock T-shirt"},{"$f":"IF(Master!C16<>\"\",Master!C16*Selection!$B$3,\"\")","v":29.5},{"$f":"IF(Master!D16<>\"\",Master!D16*Selection!$B$3,\"\")","v":28.200000000000003},"3XL",{"$f":"IF(Master!F16<>\"\",Master!F16*Selection!$B$3,\"\")","v":2.8000000000000003},{"$f":"IF(Factor!#REF!<>\"\",Factor!#REF!*Selection!$B$3,\"\")","v":{"$error":"#REF!"}}]
["0518",{"$f":"IF(Selection!$B$4=\"DK\",VLOOKUP($A17,'Style navne sprog'!$A:$I,6,FALSE),IF(Selection!$B$4=\"DE\",VLOOKUP($A17,'Style navne sprog'!$A:$I,2,FALSE),IF(Selection!$B$4=\"GB\",VLOOKUP($A17,'Style navne sprog'!$A:$I,4,FALSE),IF(Selection!$B$4=\"SE\",VLOOKUP($A17,'Style navne sprog'!$A:$I,3,FALSE),IF(Selection!$B$4=\"NO\",VLOOKUP($A17,'Style navne sprog'!$A:$I,5,FALSE),IF(Selection!$B$4=\"PL\",VLOOKUP($A17,'Style navne sprog'!$A:$I,7,FALSE)))))))","v":"Interlock T-shirt | long-sleeved"},{"$f":"IF(Master!C17<>\"\",Master!C17*Selection!$B$3,\"\")","v":37.4},{"$f":"IF(Master!D17<>\"\",Master!D17*Selection!$B$3,\"\")","v":36.1},"3XL",{"$f":"IF(Master!F17<>\"\",Master!F17*Selection!$B$3,\"\")","v":2.8000000000000003},{"$f":"IF(Factor!#REF!<>\"\",Factor!#REF!*Selection!$B$3,\"\")","v":{"$error":"#REF!"}}]
["0524",{"$f":"IF(Selection!$B$4=\"DK\",VLOOKUP($A18,'Style navne sprog'!$A:$I,6,FALSE),IF(Selection!$B$4=\"DE\",VLOOKUP($A18,'Style navne sprog'!$A:$I,2,FALSE),IF(Selection!$B$4=\"GB\",VLOOKUP($A18,'Style navne sprog'!$A:$I,4,FALSE),IF(Selection!$B$4=\"SE\",VLOOKUP($A18,'Style navne sprog'!$A:$I,3,FALSE),IF(Selection!$B$4=\"NO\",VLOOKUP($A18,'Style navne sprog'!$A:$I,5,FALSE),IF(Selection!$B$4=\"PL\",VLOOKUP($A18,'Style navne sprog'!$A:$I,7,FALSE)))))))","v":"RE-CARE T-shirt | unisex"},{"$f":"IF(Master!C18<>\"\",Master!C18*Selection!$B$3,\"\")","v":42.7},{"$f":"IF(Master!D18<>\"\",Master!D18*Selection!$B$3,\"\")","v":41.300000000000004},"3XL-4XL",{"$f":"IF(Master!F18<>\"\",Master!F18*Selection!$B$3,\"\")","v":2.8000000000000003},{"$f":"IF(Factor!#REF!<>\"\",Factor!#REF!*Selection!$B$3,\"\")","v":{"$error":"#REF!"}}]
["0528",{"$f":"IF(Selection!$B$4=\"DK\",VLOOKUP($A19,'Style navne sprog'!$A:$I,6,FALSE),IF(Selection!$B$4=\"DE\",VLOOKUP($A19,'Style navne sprog'!$A:$I,2,FALSE),IF(Selection!$B$4=\"GB\",VLOOKUP($A19,'Style navne sprog'!$A:$I,4,FALSE),IF(Selection!$B$4=\"SE\",VLOOKUP($A19,'Style navne sprog'!$A:$I,3,FALSE),IF(Selection!$B$4=\"NO\",VLOOKUP($A19,'Style navne sprog'!$A:$I,5,FALSE),IF(Selection!$B$4=\"PL\",VLOOKUP($A19,'Style navne sprog'!$A:$I,7,FALSE)))))))","v":"T-shirt Lyocell"},{"$f":"IF(Master!C19<>\"\",Master!C19*Selection!$B$3,\"\")","v":39.200000000000003},{"$f":"IF(Master!D19<>\"\",Master!D19*Selection!$B$3,\"\")","v":37.9},"3XL-6XL",{"$f":"IF(Master!F19<>\"\",Master!F19*Selection!$B$3,\"\")","v":2.8000000000000003},{"$f":"IF(Factor!#REF!<>\"\",Factor!#REF!*Selection!$B$3,\"\")","v":{"$error":"#REF!"}}]
["0529",{"$f":"IF(Selection!$B$4=\"DK\",VLOOKUP($A20,'Style navne sprog'!$A:$I,6,FALSE),IF(Selection!$B$4=\"DE\",VLOOKUP($A20,'Style navne sprog'!$A:$I,2,FALSE),IF(Selection!$B$4=\"GB\",VLOOKUP($A20,'Style navne sprog'!$A:$I,4,FALSE),IF(Selection!$B$4=\"SE\",VLOOKUP($A20,'Style navne sprog'!$A:$I,3,FALSE),IF(Selection!$B$4=\"NO\",VLOOKUP($A20,'Style navne sprog'!$A:$I,5,FALSE),IF(Selection!$B$4=\"PL\",VLOOKUP($A20,'Style navne sprog'!$A:$I,7,FALSE)))))))","v":"T-shirt Lyocell | women"},{"$f":"IF(Master!C20<>\"\",Master!C20*Selection!$B$3,\"\")","v":39.200000000000003},{"$f":"IF(Master!D20<>\"\",Master!D20*Selection!$B$3,\"\")","v":37.9},"3XL-6XL",{"$f":"IF(Master!F20<>\"\",Master!F20*Selection!$B$3,\"\")","v":2.8000000000000003},{"$f":"IF(Factor!#REF!<>\"\",Factor!#REF!*Selection!$B$3,\"\")","v":{"$error":"#REF!"}}]
{"$rows_left_out":277}
{"sheet":"Style navne sprog","index":3,"n_rows":349,"n_cols":16,"rows_kept":349,"cut":false,"hidden":true,"merged":[]}
["SeasonCode","All"]
["AreaCode","All"]
["Item Category Code","(Multiple Items)"]
[]
[]
["StyleNo","ItemNameDE","ItemNameSE","ItemNameGB","ItemNameNO","ItemName","ItemNamePL",null,null,null,null,null,null,"Opslag Master"]
["0010","Handtuch 50x100","Handduk 50x100","Towel 50x100","Håndklæde 50x100","Håndklæde 50x100","Ręcznik 50x100",null,null,null,null,null,null,{"$f":"_xlfn.XLOOKUP(A7,Master!$A:$A,Master!$A:$A)","v":"0010"},null,{"$f":"_xlfn.XLOOKUP(A7,Master!A:A,Master!A:A)","v":"0010"}]
["0011","Badehandtuch 70x140","Badhandduk 70x140","Bath towel 70x140","Badehåndklæde 70x140","Badehåndklæde 70x140","Ręcznik kąpielowy 70x140",null,null,null,null,null,null,{"$f":"_xlfn.XLOOKUP(A8,Master!$A:$A,Master!$A:$A)","v":"0011"},null,{"$f":"_xlfn.XLOOKUP(A8,Master!A:A,Master!A:A)","v":"0011"}]
["0036","Mütze | Stretch","Mössa | stretch","Hat | stretch","Hue | stretch","Hue | stretch","Czapka | stretch",null,null,null,null,null,null,{"$f":"_xlfn.XLOOKUP(A9,Master!$A:$A,Master!$A:$A)","v":"0036"},null,{"$f":"_xlfn.XLOOKUP(A9,Master!A:A,Master!A:A)","v":"0036"}]
["0038","Halswärmer | Stretch","Halsvärmare | stretch","Neck warmer | stretch","Halsedisse | stretch","Halsedisse | stretch","Komin | stretch",null,null,null,null,null,null,{"$f":"_xlfn.XLOOKUP(A10,Master!$A:$A,Master!$A:$A)","v":"0038"},null,{"$f":"_xlfn.XLOOKUP(A10,Master!A:A,Master!A:A)","v":"0038"}]
["0040","Weicher Halswärmer","Mjuk halsvärmare","Soft neck warmer","Blød halsedisse","Blød halsedisse","Soft neck warmer",null,null,null,null,null,null,{"$f":"_xlfn.XLOOKUP(A11,Master!$A:$A,Master!$A:$A)","v":"0040"},null,{"$f":"_xlfn.XLOOKUP(A11,Master!A:A,Master!A:A)","v":"0040"}]
["0042","Strickmütze","Stickad mössa","Knitted hat","Strikhue","Strikhue","Dzianinowa czapka",null,null,null,null,null,null,{"$f":"_xlfn.XLOOKUP(A12,Master!$A:$A,Master!$A:$A)","v":"0042"},null,{"$f":"_xlfn.XLOOKUP(A12,Master!A:A,Master!A:A)","v":"0042"}]
["0044","Strickmütze | Futter","Stickad mössa | fodrad","Knitted hat | lining","Strikhue | for","Strikhue | for","Czapka wełniana | z podszewką",null,null,null,null,null,null,{"$f":"_xlfn.XLOOKUP(A13,Master!$A:$A,Master!$A:$A)","v":"0044"},null,{"$f":"_xlfn.XLOOKUP(A13,Master!A:A,Master!A:A)","v":"0044"}]
["0045","Stretchmütze","Stretch mössa","Stretch hat","Stretch hat","Stretch hat","Stretch hat",null,null,null,null,null,null,{"$f":"_xlfn.XLOOKUP(A14,Master!$A:$A,Master!$A:$A)","v":"0045"},null,{"$f":"_xlfn.XLOOKUP(A14,Master!A:A,Master!A:A)","v":"0045"}]
["0050","Urban Cap","Urban keps","Urban cap","Urban cap","Urban kasket","Urban cap",null,null,null,null,null,null,{"$f":"_xlfn.XLOOKUP(A15,Master!$A:$A,Master!$A:$A)","v":"0050"},null,{"$f":"_xlfn.XLOOKUP(A15,Master!A:A,Master!A:A)","v":"0050"}]
["0052","Golf Cap","Golfkeps","Golf cap","Golf cap","Golf cap","Czapka z daszkiem",null,null,null,null,null,null,{"$f":"_xlfn.XLOOKUP(A16,Master!$A:$A,Master!$A:$A)","v":"0052"},null,{"$f":"_xlfn.XLOOKUP(A16,Master!A:A,Master!A:A)","v":"0052"}]
["0054","Twill Cap","Twillkeps","Twill cap","Bomulds cap","Bomulds cap","Czapka z daszkiem",null,null,null,null,null,null,{"$f":"_xlfn.XLOOKUP(A17,Master!$A:$A,Master!$A:$A)","v":"0054"},null,{"$f":"_xlfn.XLOOKUP(A17,Master!A:A,Master!A:A)","v":"0054"}]
["0060","Klassischer Sonnenhut","Klassisk solhat","Classic canvas bucket hat","Klassisk bøllehat","Klassisk canvas bøllehat","Classic canvas sunhat",null,null,null,null,null,null,{"$f":"_xlfn.XLOOKUP(A18,Master!$A:$A,Master!$A:$A)","v":"0060"},null,{"$f":"_xlfn.XLOOKUP(A18,Master!A:A,Master!A:A)","v":"0060"}]
["0068","Cap | Stretch","Keps | stretch","Cap | stretch","Cap | stretch","Cap | stretch","Czapka | stretch",null,null,null,null,null,null,{"$f":"_xlfn.XLOOKUP(A19,Master!$A:$A,Master!$A:$A)","v":"0068"},null,{"$f":"_xlfn.XLOOKUP(A19,Master!A:A,Master!A:A)","v":"0068"}]
["0073","Schürze","Förkläde","Apron","Forklæde","Forklæde","Fartuch",null,null,null,null,null,null,{"$f":"_xlfn.XLOOKUP(A20,Master!$A:$A,Master!$A:$A)","v":"0073"},null,{"$f":"_xlfn.XLOOKUP(A20,Master!A:A,Master!A:A)","v":"0073"}]
{"$rows_left_out":329}